Revision control

1
2020-04-09 Simon Fraser <simon.fraser@apple.com>
2
3
[Async overflow scrolling] Vertical scrolls over a horizontally scrollable overflow are captured
5
6
Reviewed by Tim Horton.
7
8
Tests for horizontal inside vertical overflow, test that hit-testing inside scrolled-to-limit horizontal scrollers
9
still allows for swipe navigation, and test the latching timeout.
10
11
* fast/scrolling/latching/iframe-latch-small-deltas-expected.txt:
12
* fast/scrolling/latching/iframe-latch-small-deltas.html:
13
* scrollingcoordinator/mac/latching/horizontal-overflow-back-swipe-expected.txt: Added.
14
* scrollingcoordinator/mac/latching/horizontal-overflow-back-swipe.html: Added.
15
* scrollingcoordinator/mac/latching/horizontal-overflow-in-vertical-overflow-expected.txt: Added.
16
* scrollingcoordinator/mac/latching/horizontal-overflow-in-vertical-overflow.html: Added.
17
18
2020-04-10 Simon Fraser <simon.fraser@apple.com>
19
20
Hit-testing a WebTiledBackingLayer with an animation asserts
22
23
Reviewed by Tim Horton.
24
25
Test that scrolling-thread-hit-tests a tiled layer with an animation on it.
26
27
* fast/scrolling/mac/hit-test-overflow-tiled-layer-expected.txt: Added.
28
* fast/scrolling/mac/hit-test-overflow-tiled-layer.html: Added.
29
30
2020-04-10 Diego Pino Garcia <dpino@igalia.com>
31
32
[GTK] Gardening, mark several WPT's IndexedDB as flaky
34
35
Unreviewed gardening.
36
37
* platform/gtk/TestExpectations:
38
39
2020-04-10 Youenn Fablet <youenn@apple.com>
40
41
SWServer should not run a service worker that is terminating
43
44
Reviewed by Chris Dumez.
45
46
* http/wpt/service-workers/resources/routines.js:
47
(async waitForServiceWorkerNoLongerRunning):
48
Use new internals API.
49
50
2020-04-09 Peng Liu <peng.liu6@apple.com>
51
52
REGRESSION: (r258434) [ Mac WK1 ] media/track/track-css-user-override.html is a flaky failure
54
55
Reviewed by Eric Carlson.
56
57
Make the test reliable by replacing the timer and testExpected based approach
58
with the approach based on testExpectedEventually. Also remove unnecessary code.
59
60
* media/track/track-css-user-override.html:
61
62
2020-04-09 Cathie Chen <cathiechen@igalia.com>
63
64
Import test for programmatic scrolling scrollend event
66
67
Reviewed by Frédéric Wang.
68
69
* tests-options.json:
70
71
2020-04-09 Daniel Bates <dabates@apple.com>
72
73
[iOS]: New test landed for r259762 landed broken: editing/editable-region/hit-test-overlap.html
76
77
Fix up the test. All sub-tests are expected to find editable elements. This is a result
78
of a last minute realization that I need to iterate over all the hit views instead of just
79
the frontmost one because the search rect can overlap multiple layers: See "iterate over all
80
the hit views" in <https://bugs.webkit.org/show_bug.cgi?id=209888#c21>. It is because of this
81
requirement that WebKit::mayContainEditableElementsInRect() can return a false positive: return
82
true that the search rect contains an editable element even though that element may be occluded
83
by a higher z-order element (composited or not). False positives are acceptable. Thouhg false
84
negatives are not.
85
86
* editing/editable-region/hit-test-overlap-expected.txt:
87
* editing/editable-region/hit-test-overlap.html:
88
89
2020-04-09 Said Abou-Hallawa <sabouhallawa@apple.com>
90
91
REGRESSION: CSS animations inside an embedded SVG image do not animate
93
94
Reviewed by Simon Fraser.
95
96
* svg/animations/css-animation-background-svg-expected.html: Added.
97
* svg/animations/css-animation-background-svg.html: Added.
98
* svg/animations/css-animation-embedded-svg-expected.html: Added.
99
* svg/animations/css-animation-embedded-svg.html: Added.
100
* svg/animations/css-animation-hover-svg-expected.html: Added.
101
* svg/animations/css-animation-hover-svg.html: Added.
102
103
2020-04-09 Keith Miller <keith_miller@apple.com>
104
105
Remove legacy X-WebKit-CSP header support
107
108
Reviewed by Geoffrey Garen.
109
110
Fix tests so they ensure we don't respect legacy CSP headers anymore.
111
112
* http/tests/security/contentSecurityPolicy/1.1/form-action-src-blocked-expected.txt:
113
* http/tests/security/contentSecurityPolicy/1.1/form-action-src-blocked.html:
114
* http/tests/security/contentSecurityPolicy/1.1/form-action-src-get-blocked-expected.txt:
115
* http/tests/security/contentSecurityPolicy/1.1/form-action-src-get-blocked.html:
116
* http/tests/security/contentSecurityPolicy/1.1/form-action-src-javascript-blocked-expected.txt:
117
* http/tests/security/contentSecurityPolicy/1.1/form-action-src-javascript-blocked.html:
118
* http/tests/security/contentSecurityPolicy/1.1/form-action-src-redirect-blocked-expected.txt:
119
* http/tests/security/contentSecurityPolicy/1.1/form-action-src-redirect-blocked.html:
120
* http/tests/security/contentSecurityPolicy/1.1/module-scriptnonce-blocked-expected.txt:
121
* http/tests/security/contentSecurityPolicy/1.1/module-scriptnonce-blocked.html:
122
* http/tests/security/contentSecurityPolicy/1.1/module-scriptnonce-invalidnonce-expected.txt:
123
* http/tests/security/contentSecurityPolicy/1.1/module-scriptnonce-invalidnonce.html:
124
* http/tests/security/contentSecurityPolicy/1.1/scripthash-blocked-by-enforced-policy-and-allowed-by-report-policy-expected.txt:
125
* http/tests/security/contentSecurityPolicy/1.1/scripthash-blocked-by-enforced-policy-and-allowed-by-report-policy.php:
126
* http/tests/security/contentSecurityPolicy/1.1/scripthash-blocked-by-legacy-enforced-policy-and-allowed-by-report-policy-expected.txt:
127
* http/tests/security/contentSecurityPolicy/1.1/scripthash-blocked-by-legacy-enforced-policy-and-allowed-by-report-policy.php:
128
* http/tests/security/contentSecurityPolicy/1.1/scripthash-blocked-by-legacy-enforced-policy-and-allowed-by-report-policy2-expected.txt:
129
* http/tests/security/contentSecurityPolicy/1.1/scripthash-blocked-by-legacy-enforced-policy-and-allowed-by-report-policy2.php:
130
* http/tests/security/contentSecurityPolicy/1.1/scripthash-blocked-by-legacy-enforced-policy-and-blocked-by-report-policy-expected.txt:
131
* http/tests/security/contentSecurityPolicy/1.1/scripthash-blocked-by-legacy-enforced-policy-and-blocked-by-report-policy.php:
132
* http/tests/security/contentSecurityPolicy/1.1/scripthash-blocked-by-legacy-enforced-policy-and-blocked-by-report-policy2-expected.txt:
133
* http/tests/security/contentSecurityPolicy/1.1/scripthash-blocked-by-legacy-enforced-policy-and-blocked-by-report-policy2.php:
134
* http/tests/security/contentSecurityPolicy/1.1/scriptnonce-blocked-by-legacy-enforced-policy-and-allowed-by-report-policy-expected.txt:
135
* http/tests/security/contentSecurityPolicy/1.1/scriptnonce-blocked-by-legacy-enforced-policy-and-allowed-by-report-policy.php:
136
* http/tests/security/contentSecurityPolicy/1.1/scriptnonce-blocked-by-legacy-enforced-policy-and-allowed-by-report-policy2-expected.txt:
137
* http/tests/security/contentSecurityPolicy/1.1/scriptnonce-blocked-by-legacy-enforced-policy-and-allowed-by-report-policy2.php:
138
* http/tests/security/contentSecurityPolicy/1.1/scriptnonce-blocked-by-legacy-enforced-policy-and-blocked-by-report-policy-expected.txt:
139
* http/tests/security/contentSecurityPolicy/1.1/scriptnonce-blocked-by-legacy-enforced-policy-and-blocked-by-report-policy.php:
140
* http/tests/security/contentSecurityPolicy/1.1/scriptnonce-blocked-by-legacy-enforced-policy-and-blocked-by-report-policy2-expected.txt:
141
* http/tests/security/contentSecurityPolicy/1.1/scriptnonce-blocked-by-legacy-enforced-policy-and-blocked-by-report-policy2.php:
142
* http/tests/security/contentSecurityPolicy/1.1/scriptnonce-blocked-expected.txt:
143
* http/tests/security/contentSecurityPolicy/1.1/scriptnonce-blocked.html:
144
* http/tests/security/contentSecurityPolicy/1.1/scriptnonce-invalidnonce-expected.txt:
145
* http/tests/security/contentSecurityPolicy/1.1/scriptnonce-invalidnonce.html:
146
147
2020-04-09 Devin Rousso <drousso@apple.com>
148
149
Web Inspector: Debugger: debug hooks should also be emitted for the first sub-expression in a comma expression
151
152
Reviewed by Joseph Pecoraro.
153
154
* inspector/debugger/breakpoints/resources/dump-general.js:
155
* inspector/debugger/breakpoints/resolved-dump-each-line-expected.txt:
156
* inspector/debugger/breakpoints/resolved-dump-all-pause-locations-expected.txt:
157
* inspector/debugger/stepping/stepOver.html:
158
* inspector/debugger/stepping/stepOver-expected.txt:
159
* inspector/formatting/formatting-javascript.html:
160
* inspector/formatting/formatting-javascript-expected.txt:
161
* inspector/formatting/resources/javascript-tests/arrow-functions-expected.js:
162
* inspector/formatting/resources/javascript-tests/comma-expressions.js: Added.
163
* inspector/formatting/resources/javascript-tests/comma-expressions-expected.js: Added.
164
165
2020-04-08 Simon Fraser <simon.fraser@apple.com>
166
167
[Async overflow scroll] Horizontal scrolls can trigger unwanted back swipes
170
171
Reviewed by Tim Horton.
172
173
Tests that rubberbanding works on a simple page, and that edge swipes work on a simple page.
174
175
Edge swipes inside overflow:scroll are still broken by latching and will be fixed later.
176
177
* resources/ui-helper.js:
178
(window.UIHelper.async mouseWheelScrollAt):
179
* scrollingcoordinator/mac/latching/main-frame-back-swipe-expected.txt: Added.
180
* scrollingcoordinator/mac/latching/main-frame-back-swipe.html: Added.
181
* scrollingcoordinator/mac/latching/simple-page-rubberbands-expected.txt: Added.
182
* scrollingcoordinator/mac/latching/simple-page-rubberbands.html: Added.
183
184
2020-04-09 Youenn Fablet <youenn@apple.com>
185
186
[MacOS] Stopping a cloned audio capture track should not stop the original audio track
189
190
Reviewed by Eric Carlson.
191
192
* fast/mediastream/mediastreamtrack-audio-clone-expected.txt: Added.
193
* fast/mediastream/mediastreamtrack-audio-clone.html: Added.
194
195
2020-04-09 Jason Lawrence <lawrence.j@apple.com>
196
197
[ iOS wk2 ] crypto/subtle/rsa-indexeddb.html is flaky timing out.
199
200
Unreviewed test gardening.
201
202
* platform/ios-wk2/TestExpectations:
203
204
2020-04-09 Alexey Shvayka <shvaikalesh@gmail.com>
205
206
getOwnPropertyDescriptor() is incorrect with Proxy of exotic object
208
209
Reviewed by Yusuke Suzuki.
210
211
* js/getOwnPropertyDescriptor-host-object-proxy-expected.txt: Added.
212
* js/getOwnPropertyDescriptor-host-object-proxy.html: Added.
213
214
2020-04-09 Diego Pino Garcia <dpino@igalia.com>
215
216
[GTK] Gardening, update TestExpectations
218
219
Unreviewed gardening.
220
221
Gardening of flaky failures.
222
223
* platform/gtk/TestExpectations:
224
225
2020-04-09 Daniel Bates <dabates@apple.com>
226
227
Fix layout tests after r259762
229
230
Fix up path to external JavaScript scripts.
231
232
* editing/editable-region/hit-test-basic.html:
233
* editing/editable-region/hit-test-fixed.html:
234
* editing/editable-region/hit-test-overlap.html:
235
236
2020-04-09 Diego Pino Garcia <dpino@igalia.com>
237
238
[WPE] Gardening of ImageOnly failures
240
241
Unreviewed gardening.
242
243
Update several ImageOnly failures.
244
245
* platform/wpe/TestExpectations:
246
247
2020-04-09 Carlos Garcia Campos <cgarcia@igalia.com>
248
249
Unreviewed GTK gardening. Remove platform specific results for http/tests/appcache/history-test.html
250
251
This was a progression, not a regression.
252
253
* platform/gtk/TestExpectations:
254
* platform/gtk/http/tests/appcache/history-test-expected.txt: Removed.
255
256
2020-04-09 Diego Pino Garcia <dpino@igalia.com>
257
258
[GTK] Gardening, flaky failures in EWS GTK-WK2
260
261
Unreviewed gardening.
262
263
Mark tests only failing in EWS GTK-WK2 as flaky.
264
265
* platform/gtk/TestExpectations:
266
267
2020-04-09 Diego Pino Garcia <dpino@igalia.com>
268
269
[WPE] Gardening, update TestExpectations
271
272
Unreviewed gardening.
273
274
* platform/wpe/TestExpectations:
275
* platform/wpe/accessibility/roles-exposed-expected.txt: Updated baseline after r259671.
276
* platform/wpe/fast/ruby/bopomofo-mixed-expected.txt: New baseline after r258990.
277
* platform/wpe/imported/w3c/web-platform-tests/css/cssom-view/cssom-getBoundingClientRect-003-expected.txt: New baseline after r259059.
278
* platform/wpe/imported/w3c/web-platform-tests/css/selectors/focus-visible-009-expected.txt: New baseline after r259194.
279
* platform/wpe/accessibility/menu-list-sends-change-notification-expected.txt: New baseline after r259438.
280
281
2020-04-08 Diego Pino Garcia <dpino@igalia.com>
282
283
[GTK] Gardening, update TestExpectations
285
286
Unreviewed gardening.
287
288
Add tests failing after r259705.
289
290
* platform/gtk/TestExpectations:
291
292
2020-04-08 Diego Pino Garcia <dpino@igalia.com>
293
294
[GTK] Gardening, update TestExpectations
296
297
Unreviewed gardening.
298
299
Clean up tests expected to fail but passed.
300
301
* platform/gtk/TestExpectations:
302
303
2020-04-08 Ryan Haddad <ryanhaddad@apple.com>
304
305
Unreviewed test gardening, remove expectations for tests that are now consistently passing.
306
307
* platform/ios-simulator-wk2/TestExpectations:
308
* platform/ios-wk2/TestExpectations:
309
* platform/ios/TestExpectations:
310
* platform/ipad/TestExpectations:
311
* platform/mac-wk2/TestExpectations:
312
* platform/mac/TestExpectations:
313
314
2020-04-08 Devin Rousso <drousso@apple.com>
315
316
Web Inspector: Debugger: treat comma sub-expressions as separate statements
318
319
Reviewed by Joseph Pecoraro.
320
321
* inspector/debugger/breakpoints/resources/dump-functions.js:
322
* inspector/debugger/breakpoints/resources/dump-general.js:
323
* inspector/debugger/breakpoints/resolved-dump-all-pause-locations-expected.txt:
324
* inspector/debugger/breakpoints/resolved-dump-each-line-expected.txt:
325
* inspector/debugger/stepping/stepOver.html:
326
* inspector/debugger/stepping/stepOver-expected.txt:
327
* inspector/debugger/stepping/stepping-function-calls.html:
328
* inspector/debugger/stepping/stepping-function-calls-expected.txt:
329
* inspector/debugger/stepping/stepping-loops.html:
330
* inspector/debugger/stepping/stepping-loops-expected.txt:
331
* inspector/debugger/stepping/stepping-misc.html:
332
* inspector/debugger/stepping/stepping-misc-expected.txt:
333
* inspector/formatting/resources/javascript-tests/for-statements.js:
334
* inspector/formatting/resources/javascript-tests/for-statements-expected.js:
335
* inspector/formatting/resources/javascript-tests/if-statements.js:
336
* inspector/formatting/resources/javascript-tests/if-statements-expected.js:
337
* inspector/formatting/resources/javascript-tests/sample-jquery-expected.js:
338
* inspector/formatting/resources/javascript-tests/sample-jquery-expected.js:
339
340
2020-04-08 Diego Pino Garcia <dpino@igalia.com>
341
342
[WPE] Gardening, update baselines after r259296
344
345
Unreviewed gardening.
346
347
* platform/wpe/css2.1/20110323/margin-applies-to-006-expected.txt:
348
* platform/wpe/ietestcenter/css3/bordersbackgrounds/border-radius-applies-to-012-expected.txt:
349
* platform/wpe/tables/mozilla_expected_failures/dom/appendCol1-expected.txt:
350
351
2020-04-08 Diego Pino Garcia <dpino@igalia.com>
352
353
[WPE] Gardening, update TestExpectations
355
356
Unreviewed gardening.
357
358
* platform/wpe/TestExpectations:
359
360
2020-04-08 Jason Lawrence <lawrence.j@apple.com>
361
362
REGRESSION: [ Mojave wk1 Debug and iOS wk2 Debug ] http/tests/IndexedDB/collect-IDB-objects.https.html is flaky timing out and crashing.
364
365
Unreviewed test gardening.
366
367
* platform/ios-wk2/TestExpectations:
368
* platform/mac-wk1/TestExpectations:
369
370
2020-04-08 Daniel Bates <dabates@apple.com>
371
372
Track editable elements on screen
375
376
Reviewed by Simon Fraser.
377
378
Add some tests. Some of these tests were derived from a torture test page written by Simon Fraser.
379
380
* TestExpectations: Skip directory editing/editable-region everywhere. I will unskip this in the iOS TestExpectations file.
381
* editing/editable-region/fixed-and-absolute-contenteditable-scrolled-expected.txt: Added.
382
* editing/editable-region/fixed-and-absolute-contenteditable-scrolled.html: Added.
383
* editing/editable-region/float-contenteditable-expected.txt: Added.
384
* editing/editable-region/float-contenteditable.html: Added.
385
* editing/editable-region/hit-test-basic-expected.txt: Added.
386
* editing/editable-region/hit-test-basic.html: Added.
387
* editing/editable-region/hit-test-fixed-expected.txt: Added.
388
* editing/editable-region/hit-test-fixed.html: Added.
389
* editing/editable-region/hit-test-overlap-expected.txt: Added.
390
* editing/editable-region/hit-test-overlap.html: Added.
391
* editing/editable-region/iframe-expected.txt: Added.
392
* editing/editable-region/iframe.html: Added.
393
* editing/editable-region/input-basic-expected.txt: Added.
394
* editing/editable-region/input-basic.html: Added.
395
* editing/editable-region/out-hanging-child-of-contenteditable-expected.txt: Added.
396
* editing/editable-region/out-hanging-child-of-contenteditable.html: Added.
397
* editing/editable-region/overflow-scroll-text-field-and-contenteditable-expected.txt: Added.
398
* editing/editable-region/overflow-scroll-text-field-and-contenteditable.html: Added.
399
* editing/editable-region/relative-inside-fixed-contenteditable-scrolled-expected.txt: Added.
400
* editing/editable-region/relative-inside-fixed-contenteditable-scrolled.html: Added.
401
* editing/editable-region/relative-inside-transformed-contenteditable-expected.txt: Added.
402
* editing/editable-region/relative-inside-transformed-contenteditable.html: Added.
403
* editing/editable-region/resources/hit-test-utilities.js: Added.
404
(async shouldHaveEditableElementsInRect):
405
(async shouldNotHaveEditableElementsInRect):
406
(shouldNotHaveEditableElementsInRectForElement):
407
* editing/editable-region/transformed-scrolled-on-top-of-fixed-contenteditables-expected.txt: Added.
408
* editing/editable-region/transformed-scrolled-on-top-of-fixed-contenteditables.html: Added.
409
* platform/ios/TestExpectations: Unskip editing/editable-region.
410
* resources/ui-helper.js:
411
(window.UIHelper.mayContainEditableElementsInRect): Added. Convenience function that turns around
412
and calls the UIScriptController function of the same name and returns a boolean instead of a string.
413
414
2020-04-08 Daniel Bates <dabates@apple.com>
415
416
Should find touch-action elements inside non-composited iframes
419
420
Reviewed by Simon Fraser.
421
422
Add more tests.
423
424
* pointerevents/ios/programmatic-touch-action-none-inside-iframe-expected.txt: Added.
425
* pointerevents/ios/programmatic-touch-action-none-inside-iframe.html: Added.
426
* pointerevents/ios/resources/touch-action-none-inside-iframe.html: Added.
427
* pointerevents/ios/touch-action-none-inside-iframe-expected.txt: Added.
428
* pointerevents/ios/touch-action-none-inside-iframe.html: Added.
429
* pointerevents/ios/touch-action-none-inside-nested-iframe-expected.txt: Added.
430
* pointerevents/ios/touch-action-none-inside-nested-iframe.html: Added.
431
432
2020-04-08 Chris Dumez <cdumez@apple.com>
433
434
Unreviewed, unskip http/tests/notifications/event-listener-crash.html
435
436
This test should no longer be crashing after r258613.
437
438
* platform/mac-wk1/TestExpectations:
439
440
2020-04-08 Per Arne Vollan <pvollan@apple.com>
441
442
[macOS] Crash under WebKit::SandboxExtension::consume
444
445
Reviewed by Geoffrey Garen.
446
447
* fast/sandbox/mac/sandbox-mach-lookup-expected.txt:
448
* fast/sandbox/mac/sandbox-mach-lookup.html:
449
450
2020-04-08 Jacob Uphoff <jacob_uphoff@apple.com>
451
452
[macOS debug] Layout Test imported/w3c/web-platform-tests/media-source/SourceBuffer-abort-readyState.html is a flaky failure
454
455
Unreviewed test gardening.
456
457
* platform/mac/TestExpectations:
458
459
2020-04-08 Devin Rousso <drousso@apple.com>
460
461
Web Inspector: Storage: cannot clear out multiple or all local storage entries
463
464
Reviewed by Timothy Hatcher.
465
466
* inspector/storage/clearDOMStorageItems.html: Added.
467
* inspector/storage/clearDOMStorageItems-expected.txt: Added.
468
* inspector/storage/domStorage-events.html:
469
* inspector/storage/domStorage-events-expected.txt:
470
* inspector/storage/getDOMStorageItems.html: Added.
471
* inspector/storage/getDOMStorageItems-expected.txt: Added.
472
* inspector/storage/removeDOMStorageItem.html: Added.
473
* inspector/storage/removeDOMStorageItem-expected.txt: Added.
474
* inspector/storage/setDOMStorageItem.html: Added.
475
* inspector/storage/setDOMStorageItem-expected.txt: Added.
476
* inspector/storage/resources/storage-utilities.js: Added.
477
(clearStorages):
478
(TestPage.registerInitializer.InspectorTest.Storage.async logEntries):
479
480
2020-04-08 Diego Pino Garcia <dpino@igalia.com>
481
482
[GTK] Gardening, update TestExpectations after r259712
484
485
Unreviewed gardening.
486
487
* platform/gtk/TestExpectations:
488
489
2020-04-08 Jason Lawrence <lawrence.j@apple.com>
490
491
REGRESSION: [ iOS wk2 Debug ] WTFCrash + 14 (Assertions.cpp:309) - WebCore::Page::recomputeTextAutoSizingInAllFrames()
493
494
Unreviewed test gardening.
495
496
* platform/ios-wk2/TestExpectations:
497
498
2020-04-08 Jason Lawrence <lawrence.j@apple.com>
499
500
[ iOS wk2 Debug ] WTFCrash + 14 (Assertions.cpp:309) - WebKit::EditorState::postLayoutData()
502
503
Unreviewed test gardening.
504
505
* platform/ios-wk2/TestExpectations:
506
507
2020-04-08 Zalan Bujtas <zalan@apple.com>
508
509
[Win] Gardening, update baselines
510
511
Unreviewed gardening.
512
513
Rebaseline after r259296.
514
515
* platform/win/css2.1/20110323/margin-applies-to-006-expected.txt:
516
* platform/win/fast/forms/form-hides-table-expected.txt:
517
* platform/win/fast/table/table-insert-before-non-anonymous-block-expected.txt:
518
* platform/win/tables/mozilla_expected_failures/dom/appendCol1-expected.txt:
519
520
2020-04-08 Jason Lawrence <lawrence.j@apple.com>
521
522
[ Mac wk1 Debug ] two webgl/2.0.0/conformance2/attribs/gl tests are flaky timing out.
524
525
Unreviewed test gardening.
526
527
* platform/mac-wk1/TestExpectations:
528
529
2020-04-08 Jacob Uphoff <jacob_uphoff@apple.com>
530
531
Flaky Test: media/modern-media-controls/tracks-support/tracks-support-show-panel-fullscreen.html
533
534
Updated expectations to include wk2
535
536
Unreviewed test gardening.
537
538
* platform/mac/TestExpectations:
539
540
2020-04-08 Doug Kelly <dougk@apple.com>
541
542
Hit test with clipPath referencing parent element causes infinite recursion
545
546
Reviewed by Geoffrey Garen.
547
548
* svg/hittest/svg-clip-path-child-element-with-use-expected.txt: Added.
549
* svg/hittest/svg-clip-path-child-element-with-use-root-expected.txt: Added.
550
* svg/hittest/svg-clip-path-child-element-with-use-root.html: Added.
551
* svg/hittest/svg-clip-path-child-element-with-use.html: Added.
552
553
2020-04-08 Antoine Quint <graouts@apple.com>
554
555
transition-property is not computed correctly when transition-duration is set to "inherit"
558
559
Reviewed by Antti Koivisto.
560
561
Add a new test that checks that setting "transition-duration" to "inherit" does not cause "transition-property" to behaves
562
as if "inherit" was implictly set as well.
563
564
* transitions/transition-property-for-element-with-transition-duration-inherit-expected.txt: Added.
565
* transitions/transition-property-for-element-with-transition-duration-inherit.html: Added.
566
567
2020-04-08 Diego Pino Garcia <dpino@igalia.com>
568
569
[GTK] Gardening, flaky failures in EWS GTK-WK2
571
572
Unreviewed gardening.
573
574
* platform/gtk/TestExpectations:
575
576
2020-04-08 Carlos Garcia Campos <cgarcia@igalia.com>
577
578
Unreviewed GTK gardening. Update expectations after r259705
579
580
Remove expectations of tests that are passing after r259705.
581
582
* platform/gtk/TestExpectations:
583
584
2020-04-08 Carlos Garcia Campos <cgarcia@igalia.com>
585
586
Unreviewed GTK gardening. Update expectations after r259705
587
588
Remove expectations of tests that are passing after r259705.
589
590
* platform/gtk/TestExpectations:
591
592
2020-04-07 Tyler Wilcock <twilco.o@protonmail.com>
593
594
[css-values-4] Support font-relative lh and rlh unit
596
597
Reviewed by Antti Koivisto.
598
599
Implement support for the font-relative 'lh' and 'rlh' units.
601
602
2020-04-07 Ryan Haddad <ryanhaddad@apple.com>
603
604
[iOS] webrtc/h265.html is consistently timing out
606
607
Unreviewed test gardening.
608
609
* platform/ios/TestExpectations: Skip the test on iOS.
610
611
2020-04-07 Zalan Bujtas <zalan@apple.com>
612
613
fastclick.com: A Gradient banner is missing
616
617
Reviewed by Simon Fraser.
618
619
* fast/backgrounds/generated-bck-image-with-small-relative-size-expected.html: Added.
620
* fast/backgrounds/generated-bck-image-with-small-relative-size.html: Added.
621
622
2020-04-07 Per Arne Vollan <pvollan@apple.com>
623
624
[iOS] Deny mach lookup access to the runningboard service in the WebContent process
626
627
Reviewed by Chris Dumez.
628
629
* fast/sandbox/ios/sandbox-mach-lookup-expected.txt:
630
* fast/sandbox/ios/sandbox-mach-lookup.html:
631
632
2020-04-07 Chris Fleizach <cfleizach@apple.com>
633
634
AX: VoiceOver can't activate combobox when textfield is inside it
636
637
Reviewed by Joanmarie Diggs.
638
639
* accessibility/activation-of-input-field-inside-other-element-expected.txt: Added.
640
* accessibility/activation-of-input-field-inside-other-element.html: Added.
641
642
2020-04-07 Jason Lawrence <lawrence.j@apple.com>
643
644
[ iOS ] http/tests/security/appcache-in-private-browsing.html is flaky timing out
646
647
Unreviewed test gardening.
648
649
* platform/ios-wk2/TestExpectations:
650
651
2020-04-07 Jason Lawrence <lawrence.j@apple.com>
652
653
[ Catalina wk2 ] webrtc/peer-connection-audio-mute2.html is flaky timing out.
655
656
Unreviewed test gardening.
657
658
* platform/mac-wk2/TestExpectations:
659
660
2020-04-07 Jacob Uphoff <jacob_uphoff@apple.com>
661
662
[ iOS wk2 ] http/wpt/cache-storage/cache-put-keys.https.any.html is flaky failing.
664
665
Unreviewed test gardening.
666
667
* platform/ios-simulator-wk2/TestExpectations:
668
669
2020-04-07 Jiewen Tan <jiewen_tan@apple.com>
670
671
[WebAuthn] Cancel WebAuthn requests when users cancel LocalAuthentication prompts
674
675
Reviewed by Brent Fulgham.
676
677
Adds a new test for the change and modifies existing tests to accommodate changes in MockWebAuthenticationConfiguration.idl.
678
679
* http/wpt/webauthn/public-key-credential-create-failure-local-silent.https.html:
680
* http/wpt/webauthn/public-key-credential-create-failure-local.https-expected.txt:
681
* http/wpt/webauthn/public-key-credential-create-failure-local.https.html:
682
* http/wpt/webauthn/public-key-credential-create-success-local.https.html:
683
* http/wpt/webauthn/public-key-credential-get-failure-local-silent.https.html:
684
* http/wpt/webauthn/public-key-credential-get-failure-local.https.html:
685
* http/wpt/webauthn/public-key-credential-get-success-local.https.html:
686
687
2020-04-07 Jacob Uphoff <jacob_uphoff@apple.com>
688
689
[ macOS debug ] REGRESSION (r259463): http/tests/media/clearkey/collect-webkit-media-session.html is failing
691
692
Unreviewed test gardening.
693
694
* platform/mac-wk2/TestExpectations:
695
696
2020-04-07 Tadeu Zagallo <tzagallo@apple.com>
697
698
Not using strict mode within ClassDeclaration statement
701
702
Reviewed by Yusuke Suzuki.
703
704
Fix the test since it contained incorrect code.
705
706
* js/class-syntax-method-names-expected.txt:
707
* js/script-tests/class-syntax-method-names.js:
708
709
2020-04-07 Joanmarie Diggs <jdiggs@igalia.com>
710
711
AX: Change ATK mapping of the ARIA alert and alertdialog roles
713
714
Reviewed by Chris Fleizach.
715
716
* accessibility/aria-mappings-expected.txt: Updated.
717
* accessibility/gtk/xml-roles-exposed-expected.txt: Updated.
718
* platform/gtk/accessibility/gtk/xml-roles-exposed-expected.txt: Updated.
719
* platform/gtk/accessibility/roles-exposed-expected.txt: Updated.
720
721
2020-04-07 Wenson Hsieh <wenson_hsieh@apple.com>
722
723
Preventing touch events should not prevent gestures installed above WKWebView from recognizing
726
727
Reviewed by Tim Horton.
728
729
Add a new layout test to verify that calling preventDefault() on touchstart doesn't prevent gesture recognizers
730
installed above the WKWebView from recognizing. To do this, we use the new UIScriptController method to add a
731
gesture recognizer to the window containing the web view, and then simulate a tap over an element that prevents
732
the touchstart event.
733
734
* fast/events/touch/ios/prevent-default-with-window-tap-gesture-expected.txt: Added.
735
* fast/events/touch/ios/prevent-default-with-window-tap-gesture.html: Added.
736
* resources/ui-helper.js:
737
(window.UIHelper.async activateElementAfterInstallingTapGestureOnWindow.return.new.Promise.):
738
(window.UIHelper.async activateElementAfterInstallingTapGestureOnWindow.return.new.Promise):
739
(window.UIHelper.async activateElementAfterInstallingTapGestureOnWindow):
740
(window.UIHelper):
741
742
2020-04-07 Truitt Savell <tsavell@apple.com>
743
744
Fix my conflict Markers
746
747
Unreviewed test gardening.
748
749
* platform/mac-wk1/TestExpectations:
750
751
2020-04-07 Truitt Savell <tsavell@apple.com>
752
753
REGRESSION: (r258434) [ Mac WK1 ] media/track/track-css-user-override.html is a flaky failure
755
756
unreviewed test gardening.
757
758
* platform/mac-wk1/TestExpectations:
759
760
2020-04-07 Diego Pino Garcia <dpino@igalia.com>
761
762
[GTK] Gardening, update TestExpectations
764
765
Unreviewed gardening.
766
767
Add more tests failing in EWS gtk-wk2 bot but not in test bot.
768
769
* platform/gtk/TestExpectations:
770
771
2020-04-07 Diego Pino Garcia <dpino@igalia.com>
772
773
[GTK] Gardening, IndexedDB flaky failures
775
776
Unreviewed gardening.
777
778
* platform/gtk/TestExpectations:
779
780
2020-04-06 Jack Lee <shihchieh_lee@apple.com>
781
782
Nullptr crash in CompositeEditCommand::splitTreeToNode when inserting image in anchor element that has uneditable parent
785
786
Reviewed by Ryosuke Niwa.
787
788
Added a regression test for the crash.
789
790
* editing/inserting/insert-img-anchor-uneditable-parent-expected.txt: Added.
791
* editing/inserting/insert-img-anchor-uneditable-parent.html: Added.
792
793
2020-04-06 Lauro Moura <lmoura@igalia.com>
794
795
[GTK][WPE] Gardening EXIF orientation failure.
796
797
Unreviewed test gardening.
798
799
* platform/gtk/TestExpectations:
800
* platform/wpe/TestExpectations:
801
802
2020-04-06 Myles C. Maxfield <mmaxfield@apple.com>
803
804
[Cocoa] REGRESSION(r254389): fast/text/international/system-language/declarative-language.html is failing
807
808
Reviewed by Simon Fraser.
809
810
minimizedLanguagesFromLanguages() is supposed to minimize the language list;
811
that's its whole raison d'être
812
813
* fast/text/international/system-language/declarative-language-expected.txt:
814
* fast/text/international/system-language/declarative-language.html:
815
* platform/mac/TestExpectations:
816
817
2020-04-06 Jack Lee <shihchieh_lee@apple.com>
818
819
Nullptr crash in WebCore::lastPositionInNode when indenting text node that has user-select:all parent.
822
823
Reviewed by Ryosuke Niwa.
824
825
Added a regression test for the crash.
826
827
* fast/editing/indent-pre-user-select-all-crash-expected.txt: Added.
828
* fast/editing/indent-pre-user-select-all-crash.html: Added.
829
830
2020-04-06 Jason Lawrence <lawrence.j@apple.com>
831
832
[ Mac wk1 Debug ] inspector/debugger/evaluateOnCallFrame-errors.html is flaky failing.
834
835
Unreviewed test gardening.
836
837
* platform/mac-wk1/TestExpectations:
838
839
2020-04-06 Jason Lawrence <lawrence.j@apple.com>
840
841
storage/indexeddb/value-cursor-cycle.html is flaky failing because it incorrectly thinks our JS GC is precise.
843
844
Unreviewed test gardening.
845
846
* platform/mac/TestExpectations:
847
848
2020-04-06 Jack Lee <shihchieh_lee@apple.com>
849
850
Nullptr crash in CompositeEditCommand::moveParagraphContentsToNewBlockIfNecessary with draggable text
853
854
Reviewed by Ryosuke Niwa.
855
856
Added a regression test for the crash.
857
858
* fast/css/style-change-draggable-text-expected.txt: Added.
859
* fast/css/style-change-draggable-text.html: Added.
860
861
2020-04-06 Jer Noble <jer.noble@apple.com>
862
863
[ Mac wk2 ] http/tests/media/track-in-band-hls-metadata.html is flaky crashing.
866
867
Reviewed by Darin Adler.
868
869
* platform/mac-wk2/TestExpectations:
870
871
2020-04-06 Manuel Rego Casasnovas <rego@igalia.com>
872
873
[GTK][WPE] Re-enable WPT web-animations animation-types tests and updating baselines
875
876
Reviewed by Carlos Alberto Lopez Perez.
877
878
These tests are no longer timing out, so this patch unflags them from TestExpectations.
879
Apart from that the -expected.txt baselines are updated too.
880
881
* platform/gtk/TestExpectations:
882
* platform/gtk/imported/w3c/web-platform-tests/web-animations/animation-model/animation-types/accumulation-per-property-expected.txt:
883
* platform/gtk/imported/w3c/web-platform-tests/web-animations/animation-model/animation-types/addition-per-property-expected.txt:
884
* platform/gtk/imported/w3c/web-platform-tests/web-animations/animation-model/animation-types/interpolation-per-property-expected.txt:
885
* platform/wpe/TestExpectations:
886
* platform/wpe/imported/w3c/web-platform-tests/web-animations/animation-model/animation-types/accumulation-per-property-expected.txt:
887
* platform/wpe/imported/w3c/web-platform-tests/web-animations/animation-model/animation-types/addition-per-property-expected.txt:
888
* platform/wpe/imported/w3c/web-platform-tests/web-animations/animation-model/animation-types/interpolation-per-property-expected.txt:
889
890
891
2020-04-06 Commit Queue <commit-queue@webkit.org>
892
893
Unreviewed, reverting r259469.
895
896
Introduced media playback regression (Requested by perarne on
897
#webkit).
898
899
Reverted changeset:
900
901
"[iOS] Deny mach lookup access to the runningboard service in
902
the WebContent process"
905
906
2020-04-06 Jacob Uphoff <jacob_uphoff@apple.com>
907
908
[ macOS ] inspector/debugger/break-in-constructor-before-super.html is a flaky failure
910
911
Unreviewed test gardening.
912
913
* platform/mac/TestExpectations:
914
915
2020-04-06 Antti Koivisto <antti@apple.com>
916
917
'currentcolor' doesn't need setHasExplicitlyInheritedProperties marking anymore
919
920
Reviewed by Darin Adler.
921
922
* fast/css/currentColor-initial-style-update-expected.txt: Added.
923
* fast/css/currentColor-initial-style-update.html: Added.
924
925
2020-04-06 Cathie Chen <cathiechen@igalia.com>
926
927
The change of zoom shouldn't affect ResizeObserverSize
929
930
Reviewed by Simon Fraser.
931
932
Add test for resizeObserver with zoom. The ResizeObserverSize shouldn't be effected by zooms.
933
934
* resize-observer/resize-observer-with-zoom-expected.txt: Added.
935
* resize-observer/resize-observer-with-zoom.html: Added.
936
937
2020-04-04 Darin Adler <darin@apple.com>
938
939
Stop using live ranges in DocumentMarkerController
941
942
Reviewed by Antti Koivisto.
943
944
* fast/scrolling/scrollbar-tickmarks-hittest-expected.txt: Removed.
945
* fast/scrolling/scrollbar-tickmarks-hittest.html: Removed.
946
* fast/scrolling/scrollbar-tickmarks-styled-expected.txt: Removed.
947
* fast/scrolling/scrollbar-tickmarks-styled.html: Removed.
948
* platform/gtk/fast/scrolling/scrollbar-tickmarks-styled-expected.png: Removed.
949
* platform/ios/TestExpectations: Removed expectation for scrollbar-tickmarks.
950
These were Chromium-specific tests.
951
952
* platform/mac-wk1/TestExpectations: Updated to expect flakiness instead of
953
repeatable failures for tests that passed locally.
954
* platform/mac/TestExpectations: Ditto.
955
956
2020-04-06 Jacob Uphoff <jacob_uphoff@apple.com>
957
958
[ macOS debug ] REGRESSION (r259463): http/tests/media/clearkey/collect-webkit-media-session.html is failing
960
961
Unreviewed test gardening.
962
963
* platform/mac-wk1/TestExpectations:
964
* platform/mac-wk2/TestExpectations:
965
966
2020-04-06 Said Abou-Hallawa <sabouhallawa@apple.com>
967
968
CanvasRenderingContext2D.drawImage should ignore the EXIF orientation if the image-orientation is none
970
971
Reviewed by Darin Adler.
972
973
* fast/images/image-orientation-none-canvas-expected.html: Added.
974
* fast/images/image-orientation-none-canvas.html: Added.
975
976
2020-04-05 Manuel Rego Casasnovas <rego@igalia.com>
977
978
Computed style for "outline-offset" is wrong when "outline-style" is "none"
980
981
Reviewed by Daniel Bates.
982
983
Update baselines for web-animations tests.
984
985
* platform/ios/imported/w3c/web-platform-tests/web-animations/animation-model/animation-types/accumulation-per-property-expected.txt:
986
* platform/ios/imported/w3c/web-platform-tests/web-animations/animation-model/animation-types/addition-per-property-expected.txt:
987
* platform/ios/imported/w3c/web-platform-tests/web-animations/animation-model/animation-types/interpolation-per-property-expected.txt:
988
989
2020-04-05 Alexey Shvayka <shvaikalesh@gmail.com>
990
991
Octal escapes should be max 3 digits and syntax errors in Unicode patterns
993
994
Reviewed by Ross Kirsling.
995
996
* fast/regex/script-tests/pcre-test-1.js:
997
* js/regexp-unicode-expected.txt:
998
* js/script-tests/regexp-unicode.js:
999
1000
2020-04-04 Lauro Moura <lmoura@igalia.com>
1001
1002
[GTK] Update test baseline after r259438 and garden crashes
1003
1004
Unreviewed test gardening.
1005
1006
* platform/gtk/TestExpectations:
1007
* platform/gtk/accessibility/menu-list-sends-change-notification-expected.txt:
1008
1009
2020-04-04 Alexey Shvayka <shvaikalesh@gmail.com>
1010
1011
'\u' should throw an early SyntaxError exception, but instead evaluates to 'u'
1013
1014
Reviewed by Yusuke Suzuki.
1015
1016
* js/script-tests/unicode-escape-sequences.js:
1017
* js/unicode-escape-sequences-expected.txt:
1018
1019
2020-04-04 Antti Koivisto <antti@apple.com>
1020
1021
Implement the css-color-4 behavior for inheritance of currentColor
1024
1025
Reviewed by Simon Fraser.
1026
1027
* TestExpectations:
1028
* fast/borders/border-color-inherit-expected.html: Copied from LayoutTests/fast/borders/border-color-inherit.html.
1029
* fast/borders/border-color-inherit.html:
1030
1031
Fix for the new behavior and make it a reftest.
1032
1033
* fast/css/webkit-text-fill-color-inherit.html:
1034
* platform/gtk/fast/borders/border-color-inherit-expected.png: Removed.
1035
* platform/gtk/fast/borders/border-color-inherit-expected.txt: Removed.
1036
* platform/ios/fast/borders/border-color-inherit-expected.txt: Removed.
1037
* platform/mac/fast/borders/border-color-inherit-expected.png: Removed.
1038
* platform/mac/fast/borders/border-color-inherit-expected.txt: Removed.
1039
* platform/win/fast/borders/border-color-inherit-expected.txt: Removed.
1040
* platform/wincairo/fast/borders/border-color-inherit-expected.txt: Removed.
1041
* platform/wpe/fast/borders/border-color-inherit-expected.txt: Removed.
1042
1043
2020-04-04 Peng Liu <peng.liu6@apple.com>
1044
1045
REGRESSION (r259095): ASSERTION FAILED: m_videoFullscreenMode != VideoFullscreenModeNone seen with TestWebKitAPI.WebKitLegacy.AudioSessionCategoryIOS
1047
1048
Reviewed by Jer Noble.
1049
1050
Remove the crashing expectation for media/media-fullscreen-return-to-inline.html
1051
1052
* platform/mac/TestExpectations:
1053
1054
2020-04-03 Truitt Savell <tsavell@apple.com>
1055
1056
Unreviewed, reverting r259440.
1057
1058
Introduced 2 failing tests on Mac and iOS
1059
1060
Reverted changeset:
1061
1062
"Add SPI to configure WebsiteDataStores with a URL for
1063
standalone web applications and use it to disable first-party
1064
website data removal in ITP"
1067
1068
2020-04-03 Ross Kirsling <ross.kirsling@sony.com>
1069
1070
Move Intl tests from LayoutTests to JSTests
1072
1073
Reviewed by Yusuke Suzuki.
1074
1075
* js/array-toLocaleString-expected.txt: Removed.
1076
* js/array-toLocaleString.html: Removed.
1077
* js/date-toLocaleString-expected.txt: Removed.
1078
* js/date-toLocaleString.html: Removed.
1079
* js/intl-collator-expected.txt: Removed.
1080
* js/intl-collator.html: Removed.
1081
* js/intl-datetimeformat-expected.txt: Removed.
1082
* js/intl-datetimeformat.html: Removed.
1083
* js/intl-default-locale-expected.txt: Removed.
1084
* js/intl-default-locale.html: Removed.
1085
* js/intl-expected.txt: Removed.
1086
* js/intl-numberformat-expected.txt: Removed.
1087
* js/intl-numberformat-format-to-parts-expected.txt: Removed.
1088
* js/intl-numberformat-format-to-parts.html: Removed.
1089
* js/intl-numberformat.html: Removed.
1090
* js/intl-pluralrules-expected.txt: Removed.
1091
* js/intl-pluralrules.html: Removed.
1092
* js/intl.html: Removed.
1093
* js/number-toLocaleString-expected.txt: Removed.
1094
* js/number-toLocaleString.html: Removed.
1095
* js/script-tests/array-toLocaleString.js: Removed.
1096
* js/script-tests/date-toLocaleString.js: Removed.
1097
* js/script-tests/intl-collator.js: Removed.
1098
* js/script-tests/intl-datetimeformat.js: Removed.
1099
* js/script-tests/intl-numberformat-format-to-parts.js: Removed.
1100
* js/script-tests/intl-numberformat.js: Removed.
1101
* js/script-tests/intl-pluralrules.js: Removed.
1102
* js/script-tests/intl.js: Removed.
1103
* js/script-tests/number-toLocaleString.js: Removed.
1104
* js/script-tests/string-localeCompare.js: Removed.
1105
* js/script-tests/string-toLocaleLowerCase.js: Removed.
1106
* js/script-tests/string-toLocaleUpperCase.js: Removed.
1107
* js/string-localeCompare-expected.txt: Removed.
1108
* js/string-localeCompare.html: Removed.
1109
* js/string-toLocaleLowerCase-expected.txt: Removed.
1110
* js/string-toLocaleLowerCase.html: Removed.
1111
* js/string-toLocaleUpperCase-expected.txt: Removed.
1112
* js/string-toLocaleUpperCase.html: Removed.
1113
* platform/ios-simulator/TestExpectations: Removed expectations.
1114
* platform/ios/TestExpectations: Removed expectations.
1115
* platform/mac/TestExpectations: Removed expectations.
1116
* platform/win/TestExpectations: Removed expectations.
1117
1118
2020-04-03 Eric Carlson <eric.carlson@apple.com>
1119
1120
Filter some capture device names
1123
1124
Reviewed by Youenn Fablet.
1125
1126
* fast/mediastream/anonymize-device-name-expected.txt: Added.
1127
* fast/mediastream/anonymize-device-name.html: Added.
1128
1129
2020-04-03 Per Arne Vollan <pvollan@apple.com>
1130
1131
[iOS] Deny mach lookup access to the runningboard service in the WebContent process
1133
1134
Reviewed by Brent Fulgham.
1135
1136
* fast/sandbox/ios/sandbox-mach-lookup-expected.txt:
1137
* fast/sandbox/ios/sandbox-mach-lookup.html:
1138
1139
2020-04-03 Sihui Liu <sihui_liu@apple.com>
1140
1141
Flaky Test: storage/indexeddb/cursor-request-cycle.html
1144
1145
Reviewed by Geoffrey Garen.
1146
1147
gc() does not guarantee all objects to be collected in our current implementation. So, instead of verifying all
1148
cursor and request objects are released, we now only check if any of them is collected, which is enough to show
1149
there is no ref cycle.
1150
1151
* storage/indexeddb/cursor-request-cycle-expected.txt:
1152
* storage/indexeddb/cursor-request-cycle-private-expected.txt:
1153
* storage/indexeddb/resources/cursor-request-cycle.js:
1154
(checkCursor):
1155
(isAnyCollected):
1156
(onOpen.otherRequest.onsuccess.otherRequestSuccess.finalRequest.onsuccess):
1157
(onOpen.otherRequest.onsuccess):
1158
(onOpen):
1159
(onOpen.cursorRequest.onsuccess): Deleted.
1160
(onOpen.otherRequest.onsuccess.otherRequestSuccess.cursorRequest.onsuccess): Deleted.
1161
1162
2020-04-03 Zalan Bujtas <zalan@apple.com>
1163
1164
[MultiColumn] Infinite loop in RenderBlockFlow::pushToNextPageWithMinimumLogicalHeight
1167
1168
Reviewed by Antti Koivisto.
1169
1170
* fast/multicol/infinite-loop-with-unbalanced-column-expected.txt: Added.
1171
* fast/multicol/infinite-loop-with-unbalanced-column.html: Added.
1172
1173
2020-04-03 youenn fablet <youenn@apple.com>
1174
1175
Add initial support for WebRTC HEVC
1177
1178
Reviewed by Eric Carlson.
1179
1180
* TestExpectations:
1181
* webrtc/h265-expected.txt: Added.
1182
* webrtc/h265.html: Added.
1183
1184
2020-04-02 John Wilander <wilander@apple.com>
1185
1186
Add SPI to configure WebsiteDataStores with a URL for standalone web applications and use it to disable first-party website data removal in ITP
1189
1190
Reviewed by Alex Christensen.
1191
1192
* http/tests/resourceLoadStatistics/standalone-web-application-exempt-from-website-data-deletion-database-expected.txt: Added.
1193
* http/tests/resourceLoadStatistics/standalone-web-application-exempt-from-website-data-deletion-database.html: Added.
1194
* http/tests/resourceLoadStatistics/standalone-web-application-exempt-from-website-data-deletion-expected.txt: Added.
1195
* http/tests/resourceLoadStatistics/standalone-web-application-exempt-from-website-data-deletion.html: Added.
1196
1197
2020-04-02 John Wilander <wilander@apple.com>
1198
1199
Rebase expectation files for anchor tag tests with line number output
1202
1203
Unreviewed test gardening.
1204
1205
* http/tests/adClickAttribution/anchor-tag-attributes-validation-expected.txt:
1206
Rebased since the lines of the console output have changed.
1207
* http/tests/security/anchor-download-block-crossorigin-expected.txt:
1208
Rebased since the lines of the console output have changed.
1209
1210
2020-04-02 Andres Gonzalez <andresg_22@apple.com>
1211
1212
Crash in RenderMenuList::didUpdateActiveOption.
1215
1216
Reviewed by Chris Fleizach.
1217
1218
Enabled accessibility/menu-list-sends-change-notification.html test
1219
and added the expected.txt file for it.
1220
1221
* accessibility/menu-list-sends-change-notification-expected.txt: Added.
1222
* accessibility/menu-list-sends-change-notification.html:
1223
1224
2020-04-02 Said Abou-Hallawa <sabouhallawa@apple.com>
1225
1226
[ iOS wk2 ] fast/images/exif-orientation-background-image-repeat.html is flaky failing.
1228
1229
Unreviewed test gardening.
1230
1231
Add "image-rendering: pixelated;" to the elements which render images to avoid unintended anti-aliasing.
1232
1233
* fast/images/exif-orientation-background-image-repeat-expected.html:
1234
* fast/images/exif-orientation-background-image-repeat.html:
1235
1236
2020-04-02 Ryosuke Niwa <rniwa@webkit.org>
1237
1238
[iOS wk2 Debug] imported/w3c/web-platform-tests/mathml/presentation-markup/scripts/cramped-001.html is failing
1240
1241
Remove the flaky failing expectation since the test appears to be passing now.
1242
1243
* platform/ios-wk2/TestExpectations:
1244
1245
2020-04-02 Simon Fraser <simon.fraser@apple.com>
1246
1247
Add some more scroll-latching tests
1249
1250
Reviewed by Zalan Bujtas.
1251
1252
Add three scroll latching tests.
1253
1254
iframe-latch-small-deltas.html tests that starting a second scroll where the dominant
1255
direction can't be determined re-uses the previous latching. This test currently fails.
1256
1257
overflow-in-iframe-latching.html tests a wheel over a scrolled-to-top overflow inside
1258
a not-scrolled-to-top iframe; the iframe should scroll. This test currently fails.
1259
1260
latching-and-wheel-events.html tests that wheel events always go to the innermost target,
1261
even if not latched, and don't propagate across frame boundaries. This test passes
1262
the event propagation part, but fails in a similar way to overflow-in-iframe-latching.html .
1263
1264
* fast/scrolling/latching/iframe-latch-small-deltas-expected.txt: Added.
1265
* fast/scrolling/latching/iframe-latch-small-deltas.html: Added.
1266
* fast/scrolling/latching/latching-and-wheel-events-expected.txt: Added.
1267
* fast/scrolling/latching/latching-and-wheel-events.html: Added.
1268
* fast/scrolling/latching/overflow-in-iframe-latching-expected.txt: Added.
1269
* fast/scrolling/latching/overflow-in-iframe-latching.html: Added.
1270
* platform/mac-wk1/fast/scrolling/latching/iframe-latch-small-deltas-expected.txt: Added.
1271
* platform/mac-wk1/fast/scrolling/latching/latching-and-wheel-events-expected.txt: Added.
1272
* platform/mac-wk1/fast/scrolling/latching/overflow-in-iframe-latching-expected.txt: Added.
1273
* resources/ui-helper.js:
1274
(window.UIHelper.async mouseWheelScrollAt):
1275
(window.UIHelper.async waitForScrollCompletion):
1276
1277
2020-04-02 Daniel Bates <dabates@apple.com>
1278
1279
Traverse float descendants when computing event and touch-action regions
1282
1283
Reviewed by Antti Koivisto.
1284
1285
Add tests to ensure that floating objects are considered when computing the
1286
event region and touch-action regions. Without this change, event-region-float.html
1287
would not create an event region at all and touch-action-region-float.html
1288
would not list the floating objects with "touch-action: none".
1289
1290
* fast/scrolling/ios/event-region-float-expected.txt: Added.
1291
* fast/scrolling/ios/event-region-float.html: Added.
1292
* pointerevents/ios/touch-action-region-float-expected.txt: Added.
1293
* pointerevents/ios/touch-action-region-float.html: Added.
1294
1295
2020-04-02 Jason Lawrence <lawrence.j@apple.com>
1296
1297
[ Mac wk1 Debug ] inspector/css/add-css-property.html is flaky timing out.
1299
1300
Unreviewed test gardening.
1301
1302
* platform/mac-wk1/TestExpectations:
1303
1304
2020-04-02 Ryan Haddad <ryanhaddad@apple.com>
1305
1306
Unreviewed test gardening.
1307
1308
* platform/mac-wk1/TestExpectations: Mark http/tests/inspector/network/har/har-page-aggressive-gc.html
1309
as slow for mac-wk1 debug.
1310
1311
2020-04-02 Wenson Hsieh <wenson_hsieh@apple.com>
1312
1313
Avoid null deref after inserting a text field with a list attribute
1316
1317
Reviewed by Ryosuke Niwa.
1318
1319
Add a layout test to exercise the crashing scenario, and verify that the end result of programmatically
1320
inserting the text field is identical to simply putting an input field with a datalist in the markup.
1321
1322
* fast/forms/datalist/append-input-with-list-attribute-expected.html: Added.
1323
* fast/forms/datalist/append-input-with-list-attribute.html: Added.
1324
1325
2020-04-01 Darin Adler <darin@apple.com>
1326
1327
Remove all uses of live ranges from TextIterator
1329
1330
Reviewed by Antti Koivisto.
1331
1332
* editing/text-iterator/find-string-on-flat-tree-expected.txt:
1333
* editing/text-iterator/find-string-on-flat-tree.html:
1334
Updated test for a progress where we properly find strings across a shadow boundary.
1335
1336
2020-04-02 David Kilzer <ddkilzer@apple.com>
1337
1338
API::PageConfiguration may have conflicting preference values between WebPreferences and WebPreferencesStore::ValueMap instance variables
1341
1342
Reviewed by Brent Fulgham.
1343
1344
* editing/undo-manager/undo-manager-add-item-exceptions.html:
1345
* editing/undo-manager/undo-manager-add-item.html:
1346
* editing/undo-manager/undo-manager-delete-stale-undo-items.html:
1347
* editing/undo-manager/undo-manager-interfaces.html:
1348
* editing/undo-manager/undo-manager-item-labels.html:
1349
* editing/undo-manager/undo-manager-keeps-wrapper-alive.html:
1350
* editing/undo-manager/undo-manager-undo-redo-after-garbage-collection.html:
1351
- Fix tests to use "internal:UndoManagerAPIEnabled=true" instead
1352
of custom "enableUndoManagerAPI=true" setting, which is being
1353
removed since it doesn't work after the changes to WebKit.
1354
1355
2020-04-02 Chris Dumez <cdumez@apple.com>
1356
1357
[ Mac wk1 ] fast/loader/child-frame-add-after-back-forward.html is flaky timing out.
1360
1361
Reviewed by Jonathan Bedard.
1362
1363
Update empty-document-goes-back.html to schedule the history.back() call *after* the load
1364
event has been fired, so that a HistoryItem has actually been created.
1365
1366
* fast/loader/resources/empty-document-goes-back.html:
1367
* platform/mac-wk1/TestExpectations:
1368
1369
2020-04-02 Jason Lawrence <lawrence.j@apple.com>
1370
1371
[ Mac wk2 Debug ] webrtc/datachannel/multiple-connections.html is flaky timing out.
1373
1374
Unreviewed test gardening.
1375
1376
* platform/mac-wk1/TestExpectations:
1377
* platform/mac-wk2/TestExpectations:
1378
* platform/mac/TestExpectations:
1379
1380
2020-04-02 Jason Lawrence <lawrence.j@apple.com>
1381
1382
[ Mac and iOS ] svg/custom/animate-initial-pause-unpause.html is flaky timing out.
1384
1385
Unreviewed test gardening.
1386
1387
* platform/ios-wk2/TestExpectations:
1388
* platform/mac/TestExpectations:
1389
1390
2020-04-02 youenn fablet <youenn@apple.com>
1391
1392
Debug crash: ASSERTION FAILED: m_ongoingFetches.contains(task.fetchIdentifier())
1394
1395
Reviewed by Darin Adler.
1396
1397
* http/wpt/service-workers/service-worker-crashing-while-fetching.https-expected.txt: Added.
1398
* http/wpt/service-workers/service-worker-crashing-while-fetching.https.html: Added.
1399
* http/wpt/service-workers/service-worker-lengthy-worker.js: Added.
1400
(fetchTest):
1401
1402
2020-04-02 youenn fablet <youenn@apple.com>
1403
1404
Remove synchronous termination of service workers
1406
1407
Reviewed by Chris Dumez.
1408
1409
* http/tests/workers/service/resources/postmessage-after-sw-process-crash.js:
1410
(async event):
1411
* http/tests/workers/service/resources/postmessage-after-terminate.js:
1412
(async event):
1413
* http/tests/workers/service/resources/postmessage-after-terminating-hung-worker.js:
1414
(async event):
1415
1416
2020-04-01 Ryan Haddad <ryanhaddad@apple.com>
1417
1418
[iOS] svg/as-background-image/tiled-background-image.html is a flaky image failure
1420
1421
Unreviewed test gardening.
1422
1423
* platform/ios/TestExpectations: Mark test as flaky.
1424
1425
2020-04-01 Ross Kirsling <ross.kirsling@sony.com>
1426
1427
Intl.NumberFormat.prototype.format must preserve sign of -0
1429
1430
Reviewed by Keith Miller.
1431
1432
* js/intl-numberformat-expected.txt:
1433
* js/script-tests/intl-numberformat.js:
1434
Fix test accordingly.
1435
1436
2020-04-01 Per Arne Vollan <pvollan@apple.com>
1437
1438
[macOS] Deny mach-lookup access to "com.apple.lsd.mapdb" in sandbox
1440
1441
Reviewed by Darin Adler.
1442
1443
* fast/sandbox/mac/sandbox-mach-lookup-expected.txt:
1444
* fast/sandbox/mac/sandbox-mach-lookup.html:
1445
1446
2020-04-01 Jason Lawrence <lawrence.j@apple.com>
1447
1448
[ Mac wk1 Debug ] inspector/page/overrideSetting-ICECandidateFilteringEnabled.html is flaky timing out.
1450
1451
Unreviewed test gardening.
1452
1453
* platform/mac-wk1/TestExpectations:
1454
1455
2020-04-01 Jason Lawrence <lawrence.j@apple.com>
1456
1457
[ Mac wk2 Debug ] webrtc/datachannel/multiple-connections.html is flaky timing out.
1459
1460
Unreviewed test gardening.
1461
1462
* platform/mac-wk1/TestExpectations:
1463
* platform/mac/TestExpectations:
1464
1465
2020-04-01 Chris Dumez <cdumez@apple.com>
1466
1467
ASSERTION FAILED: m_wrapper on imported/w3c/web-platform-tests/html/semantics/embedded-content/media-elements/ready-states/autoplay.html
1470
1471
Reviewed by Darin Adler.
1472
1473
Unmark the test as crashing.
1474
1475
* platform/mac/TestExpectations:
1476
1477
2020-04-01 Jason Lawrence <lawrence.j@apple.com>
1478
1479
[ iOS wk2 ] crypto/subtle/rsa-indexeddb-non-exportable-private.html is flaky timing out.
1481
1482
Unreviewed test gardening.
1483
1484
* platform/ios-wk2/TestExpectations:
1485
1486
2020-04-01 Jason Lawrence <lawrence.j@apple.com>
1487
1488
[ Mojave wk1 Release ] platform/mac/media/media-source/videoplaybackquality-decompressionsession.html is flaky failing.
1490
1491
Unreviewed test gardening.
1492
1493
* platform/mac-wk1/TestExpectations:
1494
1495
2020-04-01 Commit Queue <commit-queue@webkit.org>
1496
1497
Unreviewed, reverting r259328.
1499
1500
Introduced API test failures (Requested by perarne on
1501
#webkit).
1502
1503
Reverted changeset:
1504
1505
"[macOS] Deny mach-lookup access to "com.apple.lsd.mapdb" in
1506
sandbox"
1509
1510
2020-04-01 youenn fablet <youenn@apple.com>
1511
1512
Bump libwebrtc to M82
1514
1515
Reviewed by Eric Carlson.
1516
1517
This test is no longer feasible since TCP private IP address candidates are now no longer allowed.
1518
1519
* webrtc/datachannel/basic-tcp-expected.txt: Removed.
1520
* webrtc/datachannel/basic-tcp.html: Removed.
1521
1522
2020-04-01 Diego Pino Garcia <dpino@igalia.com>
1523
1524
[GTK] Gardening, failures in EWS GTK-WK2
1526
1527
Unreviewed gardening.
1528
1529
Garden failures happening in EWS GTK-WK2 but not in GTK test bot.
1530
1531
* platform/gtk/TestExpectations:
1532
1533
2020-04-01 Philippe Normand <pnormand@igalia.com>
1534
1535
[Flatpak SDK] Migration to version 0.2
1537
1538
Reviewed by Carlos Alberto Lopez Perez.
1539
1540
* http/conf/flatpak-httpd.conf: Switch back to /usr/lib/apache2
1541
path for modules. The 0.1 version of the SDK installed those in
1542
/usr/ but in retrospective, this was a mistake.
1543
1544
2020-04-01 Diego Pino Garcia <dpino@igalia.com>
1545
1546
[GTK] Gardening, update baselines
1548
1549
Unreviewed gardening.
1550
1551
Update GTK baselines after r259296.
1552
1553
* platform/gtk/css2.1/20110323/margin-applies-to-006-expected.txt:
1554
* platform/gtk/fast/forms/form-hides-table-expected.txt:
1555
* platform/gtk/ietestcenter/css3/bordersbackgrounds/border-radius-applies-to-012-expected.txt:
1556
* platform/gtk/tables/mozilla_expected_failures/dom/appendCol1-expected.txt:
1557
1558
2020-03-31 Zalan Bujtas <zalan@apple.com>
1559
1560
[MultiColumn] Call RenderTreeBuilder::multiColumnDescendantInserted only when the enclosing fragmented flow has changed
1563
1564
Reviewed by Antti Koivisto.
1565
1566
* fast/multicol/absolute-to-static-change-same-enclosing-flow-expected.txt: Added.
1567
* fast/multicol/absolute-to-static-change-same-enclosing-flow.html: Added.
1568
1569
2020-03-31 Wenson Hsieh <wenson_hsieh@apple.com>
1570
1571
Datalist option's label not used
1574
1575
Reviewed by Darin Adler.
1576
1577
Add a test to verify that when datalist suggestions incorporate option labels into the displayed text
1578
suggestions, they are matched against when changing the value of the input field, and can be selected. This is
1579
expected to be the case on macOS, but not on other platforms (for the time being).
1580
1581
* fast/forms/datalist/datalist-option-labels-expected.txt: Added.
1582
* fast/forms/datalist/datalist-option-labels.html: Added.
1583
* platform/gtk/fast/forms/datalist/datalist-option-labels-expected.txt: Added.
1584
* platform/ios/fast/forms/datalist/datalist-option-labels-expected.txt: Added.
1585
1586
2020-03-31 Per Arne Vollan <pvollan@apple.com>
1587
1588
[macOS] Deny mach-lookup access to "com.apple.lsd.mapdb" in sandbox
1590
1591
Reviewed by Darin Adler.
1592
1593
* fast/sandbox/mac/sandbox-mach-lookup-expected.txt:
1594
* fast/sandbox/mac/sandbox-mach-lookup.html:
1595
1596
2020-03-31 Ryan Haddad <ryanhaddad@apple.com>
1597
1598
[ Catalina ] editing/mac/selection/context-menu-select-editability.html is failing on Catalina
1600
1601
Unreviewed test gardening.
1602
1603
* platform/mac/TestExpectations: Remove failure expectation since the test is now passing.
1604
1605
2020-03-31 Jason Lawrence <lawrence.j@apple.com>
1606
1607
[ Mojave wk1 Release ] fast/canvas/webgl/texImage2D-mse-flipY-true.html is timing out.
1609
1610
Unreviewed test gardening.
1611
1612
* platform/mac-wk1/TestExpectations:
1613
1614
2020-03-31 Jason Lawrence <lawrence.j@apple.com>
1615
1616
[ Mac wk1 Debug] inspector/injected-script/avoid-getter-invocation.html is flaky failing.
1618
1619
Unreviewed test gardening.
1620
1621
* platform/mac-wk1/TestExpectations:
1622
1623
2020-03-31 Ryan Haddad <ryanhaddad@apple.com>
1624
1625
Unreviewed test gardening for iOS and macOS.
1626
1627
* platform/ios-simulator-wk2/TestExpectations: Skip a test that is consistently timing out.
1628
* platform/ios/TestExpectations: Skip a crashing test, add failure expectation for webkit.org/b/208023
1629
* platform/mac/TestExpectations: Add failure expectation for webkit.org/b/208023
1630
1631
2020-03-31 Jer Noble <jer.noble@apple.com>
1632
1633
REGRESSION: [ Mac wk2 Release ] Flaky crash in WebCore::MediaPlayer::createVideoFullscreenLayer
1636
1637
Reviewed by Darin Adler.
1638
1639
* platform/mac-wk2/TestExpectations:
1640
1641
2020-03-31 Jason Lawrence <lawrence.j@apple.com>
1642
1643
[ Mac Debug ] ASSERTION FAILED: m_videoFullscreenMode on media/media-fullscreen-return-to-inline.html
1645
1646
Unreviewed test gardening.
1647
1648
* platform/mac/TestExpectations:
1649
1650
2020-03-31 Chris Lord <clord@igalia.com>
1651
1652
requestAnimationFrame and cancelAnimationFrame should be present on DedicatedWorkerGlobalScope
1654
1655
Reviewed by Simon Fraser.
1656
1657
Add PASS expectations for DedicatedWorkerGlobalScope.AnimationFrameProvider on platforms where
1658
OffscreenCanvas is enabled.
1659
1660
* platform/gtk/imported/w3c/web-platform-tests/html/dom/idlharness.worker-expected.txt: Added.
1661
* platform/gtk/imported/w3c/web-platform-tests/workers/WorkerGlobalScope_requestAnimationFrame.tentative.worker-expected.txt: Added.
1662
* platform/wpe/imported/w3c/web-platform-tests/html/dom/idlharness.worker-expected.txt: Added.
1663
* platform/wpe/imported/w3c/web-platform-tests/workers/WorkerGlobalScope_requestAnimationFrame.tentative.worker-expected.txt: Added.
1664
1665
2020-03-31 Zalan Bujtas <zalan@apple.com>
1666
1667
[Tables] Infinite recursion in RenderTreeBuilder::attach
1670
1671
Reviewed by Simon Fraser.
1672
1673
* fast/table/anonymous-colgroup-simple-expected.txt: Added.
1674
* fast/table/anonymous-colgroup-simple.html: Added.
1675
1676
2020-03-31 Jason Lawrence <lawrence.j@apple.com>
1677
1678
REGRESSION: [ iOS wk2 ] fast/forms/input-text-scroll-left-on-blur.html is flaky failing.
1680
1681
Unreviewed test gardening.
1682
1683
* platform/ios-wk2/TestExpectations:
1684
1685
2020-03-31 Ryan Haddad <ryanhaddad@apple.com>
1686
1687
Flaky Test: media/track/track-in-band-metadata-display-order.html
1689
1690
Unreviewed test gardening.
1691
1692
* platform/mac-wk1/TestExpectations: Mark test as flaky.
1693
1694
2020-03-31 Diego Pino Garcia <dpino@igalia.com>
1695
1696
[WPE] Gardening, add missing expectation files
1698
1699
Unreviewed gardening.
1700
1701
* platform/wpe/fast/css/vertical-text-overflow-ellipsis-text-align-center-mixed-expected.txt: Added.
1702
* platform/wpe/fast/css/vertical-text-overflow-ellipsis-text-align-justify-mixed-expected.txt: Added.
1703
* platform/wpe/fast/css/vertical-text-overflow-ellipsis-text-align-left-mixed-expected.txt: Added.
1704
* platform/wpe/fast/css/vertical-text-overflow-ellipsis-text-align-right-mixed-expected.txt: Added.
1705
* platform/wpe/fast/html/details-marker-style-mixed-expected.txt: Added.
1706
* platform/wpe/fast/html/details-writing-mode-mixed-expected.txt: Added.
1707
* platform/wpe/fast/multicol/tall-image-behavior-lr-mixed-expected.txt: Added.
1708
* platform/wpe/fast/writing-mode/background-vertical-lr-mixed-expected.txt: Added.
1709
* platform/wpe/fast/writing-mode/background-vertical-rl-mixed-expected.txt: Added.
1710
* platform/wpe/fast/writing-mode/basic-vertical-line-mixed-expected.txt: Added.
1711
* platform/wpe/fast/writing-mode/border-styles-vertical-lr-mixed-expected.txt: Added.
1712
* platform/wpe/fast/writing-mode/border-styles-vertical-rl-mixed-expected.txt: Added.
1713
* platform/wpe/fast/writing-mode/vertical-baseline-alignment-mixed-expected.txt: Added.
1714
* platform/wpe/fast/writing-mode/vertical-lr-replaced-selection-mixed-expected.txt: Added.
1715
* platform/wpe/fast/writing-mode/vertical-rl-replaced-selection-mixed-expected.txt: Added.
1716
1717
2020-03-31 youenn fablet <youenn@apple.com>
1718
1719
Fix SDP filtering after https://trac.webkit.org/changeset/258545
1721
1722
Reviewed by Eric Carlson.
1723
1724
* webrtc/datachannel/mdns-ice-candidates-expected.txt:
1725
* webrtc/datachannel/mdns-ice-candidates.html:
1726
1727
2020-03-31 Antti Koivisto <antti@apple.com>
1728
1729
Nullptr crash in InlineTextBox::emphasisMarkExistsAndIsAbove
1731
1732
Reviewed by Zalan Bujtas.
1733
1734
* editing/selection/selection-update-during-anonymous-inline-teardown-expected.txt: Added.
1735
* editing/selection/selection-update-during-anonymous-inline-teardown.html: Added.
1736
1737
2020-03-31 Diego Pino Garcia <dpino@igalia.com>
1738
1739
[GTK] Gardening, update TestExpectations and add baseline
1741
1742
Unreviewed gardening.
1743
1744
* platform/gtk/TestExpectations:
1745
* platform/gtk/imported/w3c/web-platform-tests/css/selectors/focus-visible-009-expected.txt: Added.
1746
1747
2020-03-30 Antti Koivisto <antti@apple.com>
1748
1749
Delete css-modsel-* tests under css3/ and fast/
1751
1752
Reviewed by Antoine Quint.
1753
1754
Updated WPT reftest versions of these old tests exist under imported/w3c/web-platform-tests/css/selectors/old-tests.
1755
Remove the obsolete (and sometimes flaky) render tree dump versions.
1756
1757
* css3/css3-modsel-33.html: Removed.
1758
* css3/css3-modsel-35.html: Removed.
1759
* css3/css3-modsel-36.html: Removed.
1760
* css3/css3-modsel-37.html: Removed.
1761
* css3/selectors3/html/css3-modsel-1.html: Removed.
1762
* css3/selectors3/html/css3-modsel-10.html: Removed.
1763
* css3/selectors3/html/css3-modsel-11.html: Removed.
1764
* css3/selectors3/html/css3-modsel-13.html: Removed.
1765
* css3/selectors3/html/css3-modsel-14.html: Removed.
1766
* css3/selectors3/html/css3-modsel-144.html: Removed.
1767
* css3/selectors3/html/css3-modsel-148.html: Removed.
1768
* css3/selectors3/html/css3-modsel-149.html: Removed.
1769
* css3/selectors3/html/css3-modsel-149b.html: Removed.
1770
* css3/selectors3/html/css3-modsel-14b.html: Removed.
1771
* css3/selectors3/html/css3-modsel-14c.html: Removed.
1772
* css3/selectors3/html/css3-modsel-14d.html: Removed.
1773
* css3/selectors3/html/css3-modsel-14e.html: Removed.
1774
* css3/selectors3/html/css3-modsel-15.html: Removed.
1775
* css3/selectors3/html/css3-modsel-150.html: Removed.
1776
* css3/selectors3/html/css3-modsel-151.html: Removed.
1777
* css3/selectors3/html/css3-modsel-152.html: Removed.
1778
* css3/selectors3/html/css3-modsel-154.html: Removed.
1779
* css3/selectors3/html/css3-modsel-155.html: Removed.
1780
* css3/selectors3/html/css3-modsel-155a.html: Removed.
1781
* css3/selectors3/html/css3-modsel-155b.html: Removed.
1782
* css3/selectors3/html/css3-modsel-155c.html: Removed.
1783
* css3/selectors3/html/css3-modsel-155d.html: Removed.
1784
* css3/selectors3/html/css3-modsel-156.html: Removed.
1785
* css3/selectors3/html/css3-modsel-156b.html: Removed.
1786
* css3/selectors3/html/css3-modsel-156c.html: Removed.
1787
* css3/selectors3/html/css3-modsel-157.html: Removed.
1788
* css3/selectors3/html/css3-modsel-158.html: Removed.
1789
* css3/selectors3/html/css3-modsel-159.html: Removed.
1790
* css3/selectors3/html/css3-modsel-15b.html: Removed.
1791
* css3/selectors3/html/css3-modsel-16.html: Removed.
1792
* css3/selectors3/html/css3-modsel-160.html: Removed.
1793
* css3/selectors3/html/css3-modsel-161.html: Removed.
1794
* css3/selectors3/html/css3-modsel-166.html: Removed.
1795
* css3/selectors3/html/css3-modsel-166a.html: Removed.
1796
* css3/selectors3/html/css3-modsel-167.html: Removed.
1797
* css3/selectors3/html/css3-modsel-167a.html: Removed.
1798
* css3/selectors3/html/css3-modsel-168.html: Removed.
1799
* css3/selectors3/html/css3-modsel-168a.html: Removed.
1800
* css3/selectors3/html/css3-modsel-169.html: Removed.
1801
* css3/selectors3/html/css3-modsel-169a.html: Removed.
1802
* css3/selectors3/html/css3-modsel-17-expected.png: Removed.
1803
* css3/selectors3/html/css3-modsel-17.html: Removed.
1804
* css3/selectors3/html/css3-modsel-170.html: Removed.
1805
* css3/selectors3/html/css3-modsel-170a.html: Removed.
1806
* css3/selectors3/html/css3-modsel-170b.html: Removed.
1807
* css3/selectors3/html/css3-modsel-170c.html: Removed.
1808
* css3/selectors3/html/css3-modsel-170d.html: Removed.
1809
* css3/selectors3/html/css3-modsel-175a.html: Removed.
1810
* css3/selectors3/html/css3-modsel-175b.html: Removed.
1811
* css3/selectors3/html/css3-modsel-175c.html: Removed.
1812
* css3/selectors3/html/css3-modsel-176.html: Removed.
1813
* css3/selectors3/html/css3-modsel-177a-expected.png: Removed.
1814
* css3/selectors3/html/css3-modsel-177a.html: Removed.
1815
* css3/selectors3/html/css3-modsel-177b.html: Removed.
1816
* css3/selectors3/html/css3-modsel-178.html: Removed.
1817
* css3/selectors3/html/css3-modsel-179.html: Removed.
1818
* css3/selectors3/html/css3-modsel-179a.html: Removed.
1819
* css3/selectors3/html/css3-modsel-18.html: Removed.
1820
* css3/selectors3/html/css3-modsel-180a.html: Removed.
1821
* css3/selectors3/html/css3-modsel-181.html: Removed.
1822
* css3/selectors3/html/css3-modsel-183.html: Removed.
1823
* css3/selectors3/html/css3-modsel-184a.html: Removed.
1824
* css3/selectors3/html/css3-modsel-184b.html: Removed.
1825
* css3/selectors3/html/css3-modsel-184c.html: Removed.
1826
* css3/selectors3/html/css3-modsel-184d.html: Removed.
1827
* css3/selectors3/html/css3-modsel-184e.html: Removed.
1828
* css3/selectors3/html/css3-modsel-184f.html: Removed.
1829
* css3/selectors3/html/css3-modsel-18a.html: Removed.
1830
* css3/selectors3/html/css3-modsel-18b.html: Removed.
1831
* css3/selectors3/html/css3-modsel-18c-expected.png: Removed.
1832
* css3/selectors3/html/css3-modsel-18c.html: Removed.
1833
* css3/selectors3/html/css3-modsel-19.html: Removed.
1834
* css3/selectors3/html/css3-modsel-19b.html: Removed.
1835
* css3/selectors3/html/css3-modsel-2.html: Removed.
1836
* css3/selectors3/html/css3-modsel-20.html: Removed.
1837
* css3/selectors3/html/css3-modsel-21.html: Removed.
1838
* css3/selectors3/html/css3-modsel-21b.html: Removed.
1839
* css3/selectors3/html/css3-modsel-21c.html: Removed.
1840
* css3/selectors3/html/css3-modsel-22.html: Removed.
1841
* css3/selectors3/html/css3-modsel-23.html: Removed.
1842
* css3/selectors3/html/css3-modsel-24.html: Removed.
1843
* css3/selectors3/html/css3-modsel-25.html: Removed.
1844
* css3/selectors3/html/css3-modsel-27.html: Removed.
1845
* css3/selectors3/html/css3-modsel-27a-expected.png: Removed.
1846
* css3/selectors3/html/css3-modsel-27a.html: Removed.
1847
* css3/selectors3/html/css3-modsel-27b-expected.png: Removed.
1848
* css3/selectors3/html/css3-modsel-27b.html: Removed.
1849
* css3/selectors3/html/css3-modsel-28.html: Removed.
1850
* css3/selectors3/html/css3-modsel-28b.html: Removed.
1851
* css3/selectors3/html/css3-modsel-29.html: Removed.
1852
* css3/selectors3/html/css3-modsel-29b.html: Removed.
1853
* css3/selectors3/html/css3-modsel-30.html: Removed.
1854
* css3/selectors3/html/css3-modsel-31.html: Removed.
1855
* css3/selectors3/html/css3-modsel-32.html: Removed.
1856
* css3/selectors3/html/css3-modsel-33.html: Removed.
1857
* css3/selectors3/html/css3-modsel-34.html: Removed.
1858
* css3/selectors3/html/css3-modsel-35.html: Removed.
1859
* css3/selectors3/html/css3-modsel-36.html: Removed.
1860
* css3/selectors3/html/css3-modsel-37.html: Removed.
1861
* css3/selectors3/html/css3-modsel-38.html: Removed.
1862
* css3/selectors3/html/css3-modsel-39.html: Removed.
1863
* css3/selectors3/html/css3-modsel-39a.html: Removed.
1864
* css3/selectors3/html/css3-modsel-39b.html: Removed.
1865
* css3/selectors3/html/css3-modsel-39c.html: Removed.
1866
* css3/selectors3/html/css3-modsel-3a.html: Removed.
1867
* css3/selectors3/html/css3-modsel-4.html: Removed.
1868
* css3/selectors3/html/css3-modsel-41.html: Removed.
1869
* css3/selectors3/html/css3-modsel-41a.html: Removed.
1870
* css3/selectors3/html/css3-modsel-42.html: Removed.
1871
* css3/selectors3/html/css3-modsel-42a.html: Removed.
1872
* css3/selectors3/html/css3-modsel-43.html: Removed.
1873
* css3/selectors3/html/css3-modsel-43b.html: Removed.
1874
* css3/selectors3/html/css3-modsel-44.html: Removed.
1875
* css3/selectors3/html/css3-modsel-44b.html: Removed.
1876
* css3/selectors3/html/css3-modsel-44c.html: Removed.
1877
* css3/selectors3/html/css3-modsel-44d.html: Removed.
1878
* css3/selectors3/html/css3-modsel-45.html: Removed.
1879
* css3/selectors3/html/css3-modsel-45b.html: Removed.
1880
* css3/selectors3/html/css3-modsel-45c.html: Removed.
1881
* css3/selectors3/html/css3-modsel-46.html: Removed.
1882
* css3/selectors3/html/css3-modsel-46b.html: Removed.
1883
* css3/selectors3/html/css3-modsel-5.html: Removed.
1884
* css3/selectors3/html/css3-modsel-54.html: Removed.
1885
* css3/selectors3/html/css3-modsel-55.html: Removed.
1886
* css3/selectors3/html/css3-modsel-56.html: Removed.
1887
* css3/selectors3/html/css3-modsel-59.html: Removed.
1888
* css3/selectors3/html/css3-modsel-6.html: Removed.
1889
* css3/selectors3/html/css3-modsel-60.html: Removed.
1890
* css3/selectors3/html/css3-modsel-61-expected.png: Removed.
1891
* css3/selectors3/html/css3-modsel-61.html: Removed.
1892
* css3/selectors3/html/css3-modsel-62.html: Removed.
1893
* css3/selectors3/html/css3-modsel-63.html: Removed.
1894
* css3/selectors3/html/css3-modsel-64.html: Removed.
1895
* css3/selectors3/html/css3-modsel-65.html: Removed.
1896
* css3/selectors3/html/css3-modsel-66.html: Removed.
1897
* css3/selectors3/html/css3-modsel-66b.html: Removed.
1898
* css3/selectors3/html/css3-modsel-67.html: Removed.
1899
* css3/selectors3/html/css3-modsel-68.html: Removed.
1900
* css3/selectors3/html/css3-modsel-69.html: Removed.
1901
* css3/selectors3/html/css3-modsel-7.html: Removed.
1902
* css3/selectors3/html/css3-modsel-70.html: Removed.
1903
* css3/selectors3/html/css3-modsel-72.html: Removed.
1904
* css3/selectors3/html/css3-modsel-72b.html: Removed.
1905
* css3/selectors3/html/css3-modsel-73.html: Removed.
1906
* css3/selectors3/html/css3-modsel-73b.html: Removed.
1907
* css3/selectors3/html/css3-modsel-74.html: Removed.
1908
* css3/selectors3/html/css3-modsel-74b.html: Removed.
1909
* css3/selectors3/html/css3-modsel-75.html: Removed.
1910
* css3/selectors3/html/css3-modsel-75b.html: Removed.
1911
* css3/selectors3/html/css3-modsel-76.html: Removed.
1912
* css3/selectors3/html/css3-modsel-76b.html: Removed.
1913
* css3/selectors3/html/css3-modsel-77.html: Removed.
1914
* css3/selectors3/html/css3-modsel-77b.html: Removed.
1915
* css3/selectors3/html/css3-modsel-78.html: Removed.
1916
* css3/selectors3/html/css3-modsel-78b.html: Removed.
1917
* css3/selectors3/html/css3-modsel-79.html: Removed.
1918
* css3/selectors3/html/css3-modsel-7b.html: Removed.
1919
* css3/selectors3/html/css3-modsel-8.html: Removed.
1920
* css3/selectors3/html/css3-modsel-80.html: Removed.
1921
* css3/selectors3/html/css3-modsel-81.html: Removed.
1922
* css3/selectors3/html/css3-modsel-81b.html: Removed.
1923
* css3/selectors3/html/css3-modsel-82.html: Removed.
1924
* css3/selectors3/html/css3-modsel-82b.html: Removed.
1925
* css3/selectors3/html/css3-modsel-83.html: Removed.
1926
* css3/selectors3/html/css3-modsel-86.html: Removed.
1927
* css3/selectors3/html/css3-modsel-87.html: Removed.
1928
* css3/selectors3/html/css3-modsel-87b.html: Removed.
1929
* css3/selectors3/html/css3-modsel-88.html: Removed.
1930
* css3/selectors3/html/css3-modsel-88b.html: Removed.
1931
* css3/selectors3/html/css3-modsel-89.html: Removed.
1932
* css3/selectors3/html/css3-modsel-9.html: Removed.
1933
* css3/selectors3/html/css3-modsel-90.html: Removed.
1934
* css3/selectors3/html/css3-modsel-90b.html: Removed.
1935
* css3/selectors3/html/css3-modsel-d1.html: Removed.
1936
* css3/selectors3/html/css3-modsel-d1b.html: Removed.
1937
* css3/selectors3/html/css3-modsel-d2.html: Removed.
1938
* css3/selectors3/html/css3-modsel-d4.html: Removed.
1939
* css3/selectors3/xhtml/css3-modsel-1.xml: Removed.
1940
* css3/selectors3/xhtml/css3-modsel-10.xml: Removed.
1941
* css3/selectors3/xhtml/css3-modsel-100.xml: Removed.
1942
* css3/selectors3/xhtml/css3-modsel-100b.xml: Removed.
1943
* css3/selectors3/xhtml/css3-modsel-101.xml: Removed.
1944
* css3/selectors3/xhtml/css3-modsel-101b.xml: Removed.
1945
* css3/selectors3/xhtml/css3-modsel-102.xml: Removed.
1946
* css3/selectors3/xhtml/css3-modsel-102b.xml: Removed.
1947
* css3/selectors3/xhtml/css3-modsel-103.xml: Removed.
1948
* css3/selectors3/xhtml/css3-modsel-103b.xml: Removed.
1949
* css3/selectors3/xhtml/css3-modsel-104.xml: Removed.
1950
* css3/selectors3/xhtml/css3-modsel-104b.xml: Removed.
1951
* css3/selectors3/xhtml/css3-modsel-105.xml: Removed.
1952
* css3/selectors3/xhtml/css3-modsel-105b.xml: Removed.
1953
* css3/selectors3/xhtml/css3-modsel-106.xml: Removed.
1954
* css3/selectors3/xhtml/css3-modsel-106b.xml: Removed.
1955
* css3/selectors3/xhtml/css3-modsel-107.xml: Removed.
1956
* css3/selectors3/xhtml/css3-modsel-107b.xml: Removed.
1957
* css3/selectors3/xhtml/css3-modsel-108.xml: Removed.
1958
* css3/selectors3/xhtml/css3-modsel-108b.xml: Removed.
1959
* css3/selectors3/xhtml/css3-modsel-109.xml: Removed.
1960
* css3/selectors3/xhtml/css3-modsel-109b.xml: Removed.
1961
* css3/selectors3/xhtml/css3-modsel-11.xml: Removed.
1962
* css3/selectors3/xhtml/css3-modsel-110.xml: Removed.
1963
* css3/selectors3/xhtml/css3-modsel-110b.xml: Removed.
1964
* css3/selectors3/xhtml/css3-modsel-111.xml: Removed.
1965
* css3/selectors3/xhtml/css3-modsel-111b.xml: Removed.
1966
* css3/selectors3/xhtml/css3-modsel-112.xml: Removed.
1967
* css3/selectors3/xhtml/css3-modsel-112b.xml: Removed.
1968
* css3/selectors3/xhtml/css3-modsel-113.xml: Removed.
1969
* css3/selectors3/xhtml/css3-modsel-113b.xml: Removed.
1970
* css3/selectors3/xhtml/css3-modsel-114.xml: Removed.
1971
* css3/selectors3/xhtml/css3-modsel-114b.xml: Removed.
1972
* css3/selectors3/xhtml/css3-modsel-115.xml: Removed.
1973
* css3/selectors3/xhtml/css3-modsel-115b.xml: Removed.
1974
* css3/selectors3/xhtml/css3-modsel-116.xml: Removed.
1975
* css3/selectors3/xhtml/css3-modsel-116b.xml: Removed.
1976
* css3/selectors3/xhtml/css3-modsel-117.xml: Removed.
1977
* css3/selectors3/xhtml/css3-modsel-117b.xml: Removed.
1978
* css3/selectors3/xhtml/css3-modsel-118.xml: Removed.
1979
* css3/selectors3/xhtml/css3-modsel-119.xml: Removed.
1980
* css3/selectors3/xhtml/css3-modsel-120.xml: Removed.
1981
* css3/selectors3/xhtml/css3-modsel-121.xml: Removed.
1982
* css3/selectors3/xhtml/css3-modsel-122.xml: Removed.
1983
* css3/selectors3/xhtml/css3-modsel-123.xml: Removed.
1984
* css3/selectors3/xhtml/css3-modsel-123b-expected.png: Removed.
1985
* css3/selectors3/xhtml/css3-modsel-123b.xml: Removed.
1986
* css3/selectors3/xhtml/css3-modsel-124.xml: Removed.
1987
* css3/selectors3/xhtml/css3-modsel-124b.xml: Removed.
1988
* css3/selectors3/xhtml/css3-modsel-125.xml: Removed.
1989
* css3/selectors3/xhtml/css3-modsel-125b.xml: Removed.
1990
* css3/selectors3/xhtml/css3-modsel-126.xml: Removed.
1991
* css3/selectors3/xhtml/css3-modsel-126b.xml: Removed.
1992
* css3/selectors3/xhtml/css3-modsel-127.xml: Removed.
1993
* css3/selectors3/xhtml/css3-modsel-127b.xml: Removed.
1994
* css3/selectors3/xhtml/css3-modsel-128.xml: Removed.
1995
* css3/selectors3/xhtml/css3-modsel-128b.xml: Removed.
1996
* css3/selectors3/xhtml/css3-modsel-129.xml: Removed.
1997
* css3/selectors3/xhtml/css3-modsel-129b.xml: Removed.
1998
* css3/selectors3/xhtml/css3-modsel-13.xml: Removed.
1999
* css3/selectors3/xhtml/css3-modsel-130.xml: Removed.
2000
* css3/selectors3/xhtml/css3-modsel-130b.xml: Removed.
2001
* css3/selectors3/xhtml/css3-modsel-131.xml: Removed.
2002
* css3/selectors3/xhtml/css3-modsel-131b.xml: Removed.
2003
* css3/selectors3/xhtml/css3-modsel-132.xml: Removed.
2004
* css3/selectors3/xhtml/css3-modsel-132b.xml: Removed.
2005
* css3/selectors3/xhtml/css3-modsel-133.xml: Removed.
2006
* css3/selectors3/xhtml/css3-modsel-133b.xml: Removed.
2007
* css3/selectors3/xhtml/css3-modsel-134.xml: Removed.
2008
* css3/selectors3/xhtml/css3-modsel-134b.xml: Removed.
2009
* css3/selectors3/xhtml/css3-modsel-135.xml: Removed.
2010
* css3/selectors3/xhtml/css3-modsel-135b.xml: Removed.
2011
* css3/selectors3/xhtml/css3-modsel-136.xml: Removed.
2012
* css3/selectors3/xhtml/css3-modsel-136b.xml: Removed.
2013
* css3/selectors3/xhtml/css3-modsel-137.xml: Removed.
2014
* css3/selectors3/xhtml/css3-modsel-137b.xml: Removed.
2015
* css3/selectors3/xhtml/css3-modsel-138.xml: Removed.
2016
* css3/selectors3/xhtml/css3-modsel-138b.xml: Removed.
2017
* css3/selectors3/xhtml/css3-modsel-139.xml: Removed.
2018
* css3/selectors3/xhtml/css3-modsel-139b.xml: Removed.
2019
* css3/selectors3/xhtml/css3-modsel-14.xml: Removed.
2020
* css3/selectors3/xhtml/css3-modsel-140.xml: Removed.
2021
* css3/selectors3/xhtml/css3-modsel-140b.xml: Removed.
2022
* css3/selectors3/xhtml/css3-modsel-141.xml: Removed.
2023
* css3/selectors3/xhtml/css3-modsel-141b.xml: Removed.
2024
* css3/selectors3/xhtml/css3-modsel-142.xml: Removed.
2025
* css3/selectors3/xhtml/css3-modsel-142b.xml: Removed.
2026
* css3/selectors3/xhtml/css3-modsel-143.xml: Removed.
2027
* css3/selectors3/xhtml/css3-modsel-143b.xml: Removed.
2028
* css3/selectors3/xhtml/css3-modsel-144.xml: Removed.
2029
* css3/selectors3/xhtml/css3-modsel-145a.xml: Removed.
2030
* css3/selectors3/xhtml/css3-modsel-145b.xml: Removed.
2031
* css3/selectors3/xhtml/css3-modsel-146a.xml: Removed.
2032
* css3/selectors3/xhtml/css3-modsel-146b.xml: Removed.
2033
* css3/selectors3/xhtml/css3-modsel-147a.xml: Removed.
2034
* css3/selectors3/xhtml/css3-modsel-147b.xml: Removed.
2035
* css3/selectors3/xhtml/css3-modsel-148.xml: Removed.
2036
* css3/selectors3/xhtml/css3-modsel-149.xml: Removed.
2037
* css3/selectors3/xhtml/css3-modsel-149b.xml: Removed.
2038
* css3/selectors3/xhtml/css3-modsel-14b.xml: Removed.
2039
* css3/selectors3/xhtml/css3-modsel-14c.xml: Removed.
2040
* css3/selectors3/xhtml/css3-modsel-14d.xml: Removed.
2041
* css3/selectors3/xhtml/css3-modsel-14e.xml: Removed.
2042
* css3/selectors3/xhtml/css3-modsel-15.xml: Removed.
2043
* css3/selectors3/xhtml/css3-modsel-150.xml: Removed.
2044
* css3/selectors3/xhtml/css3-modsel-151.xml: Removed.
2045
* css3/selectors3/xhtml/css3-modsel-152.xml: Removed.
2046
* css3/selectors3/xhtml/css3-modsel-153.xml: Removed.
2047
* css3/selectors3/xhtml/css3-modsel-154.xml: Removed.
2048
* css3/selectors3/xhtml/css3-modsel-155.xml: Removed.
2049
* css3/selectors3/xhtml/css3-modsel-155a.xml: Removed.
2050
* css3/selectors3/xhtml/css3-modsel-155b.xml: Removed.
2051
* css3/selectors3/xhtml/css3-modsel-155c.xml: Removed.
2052
* css3/selectors3/xhtml/css3-modsel-155d.xml: Removed.
2053
* css3/selectors3/xhtml/css3-modsel-156.xml: Removed.
2054
* css3/selectors3/xhtml/css3-modsel-156b.xml: Removed.
2055
* css3/selectors3/xhtml/css3-modsel-156c.xml: Removed.
2056
* css3/selectors3/xhtml/css3-modsel-157.xml: Removed.
2057
* css3/selectors3/xhtml/css3-modsel-158.xml: Removed.
2058
* css3/selectors3/xhtml/css3-modsel-159.xml: Removed.
2059
* css3/selectors3/xhtml/css3-modsel-15b.xml: Removed.
2060
* css3/selectors3/xhtml/css3-modsel-15c.xml: Removed.
2061
* css3/selectors3/xhtml/css3-modsel-16.xml: Removed.
2062
* css3/selectors3/xhtml/css3-modsel-160.xml: Removed.
2063
* css3/selectors3/xhtml/css3-modsel-161.xml: Removed.
2064
* css3/selectors3/xhtml/css3-modsel-166.xml: Removed.
2065
* css3/selectors3/xhtml/css3-modsel-166a.xml: Removed.
2066
* css3/selectors3/xhtml/css3-modsel-167.xml: Removed.
2067
* css3/selectors3/xhtml/css3-modsel-167a.xml: Removed.
2068
* css3/selectors3/xhtml/css3-modsel-168.xml: Removed.
2069
* css3/selectors3/xhtml/css3-modsel-168a.xml: Removed.
2070
* css3/selectors3/xhtml/css3-modsel-169.xml: Removed.
2071
* css3/selectors3/xhtml/css3-modsel-169a.xml: Removed.
2072
* css3/selectors3/xhtml/css3-modsel-17-expected.png: Removed.
2073
* css3/selectors3/xhtml/css3-modsel-17.xml: Removed.
2074
* css3/selectors3/xhtml/css3-modsel-170.xml: Removed.
2075
* css3/selectors3/xhtml/css3-modsel-170a.xml: Removed.
2076
* css3/selectors3/xhtml/css3-modsel-170b.xml: Removed.
2077
* css3/selectors3/xhtml/css3-modsel-170c.xml: Removed.
2078
* css3/selectors3/xhtml/css3-modsel-170d.xml: Removed.
2079
* css3/selectors3/xhtml/css3-modsel-171.xml: Removed.
2080
* css3/selectors3/xhtml/css3-modsel-172a.xml: Removed.
2081
* css3/selectors3/xhtml/css3-modsel-172b.xml: Removed.
2082
* css3/selectors3/xhtml/css3-modsel-173a.xml: Removed.
2083
* css3/selectors3/xhtml/css3-modsel-173b.xml: Removed.
2084
* css3/selectors3/xhtml/css3-modsel-174a.xml: Removed.
2085
* css3/selectors3/xhtml/css3-modsel-174b.xml: Removed.
2086
* css3/selectors3/xhtml/css3-modsel-175a.xml: Removed.
2087
* css3/selectors3/xhtml/css3-modsel-175b.xml: Removed.
2088
* css3/selectors3/xhtml/css3-modsel-175c.xml: Removed.
2089
* css3/selectors3/xhtml/css3-modsel-176.xml: Removed.
2090
* css3/selectors3/xhtml/css3-modsel-177a-expected.png: Removed.
2091
* css3/selectors3/xhtml/css3-modsel-177a.xml: Removed.
2092
* css3/selectors3/xhtml/css3-modsel-177b.xml: Removed.
2093
* css3/selectors3/xhtml/css3-modsel-178.xml: Removed.
2094
* css3/selectors3/xhtml/css3-modsel-179.xml: Removed.
2095
* css3/selectors3/xhtml/css3-modsel-179a.xml: Removed.
2096
* css3/selectors3/xhtml/css3-modsel-18.xml: Removed.
2097
* css3/selectors3/xhtml/css3-modsel-180a.xml: Removed.
2098
* css3/selectors3/xhtml/css3-modsel-181.xml: Removed.
2099
* css3/selectors3/xhtml/css3-modsel-182.xml: Removed.
2100
* css3/selectors3/xhtml/css3-modsel-183.xml: Removed.
2101
* css3/selectors3/xhtml/css3-modsel-184a.xml: Removed.
2102
* css3/selectors3/xhtml/css3-modsel-184b.xml: Removed.
2103
* css3/selectors3/xhtml/css3-modsel-184c.xml: Removed.
2104
* css3/selectors3/xhtml/css3-modsel-184d.xml: Removed.
2105
* css3/selectors3/xhtml/css3-modsel-184e.xml: Removed.
2106
* css3/selectors3/xhtml/css3-modsel-184f.xml: Removed.
2107
* css3/selectors3/xhtml/css3-modsel-18a.xml: Removed.
2108
* css3/selectors3/xhtml/css3-modsel-18b.xml: Removed.
2109
* css3/selectors3/xhtml/css3-modsel-18c-expected.png: Removed.
2110
* css3/selectors3/xhtml/css3-modsel-18c.xml: Removed.
2111
* css3/selectors3/xhtml/css3-modsel-19.xml: Removed.
2112
* css3/selectors3/xhtml/css3-modsel-19b.xml: Removed.
2113
* css3/selectors3/xhtml/css3-modsel-2.xml: Removed.
2114
* css3/selectors3/xhtml/css3-modsel-20.xml: Removed.
2115
* css3/selectors3/xhtml/css3-modsel-21.xml: Removed.
2116
* css3/selectors3/xhtml/css3-modsel-21b.xml: Removed.
2117
* css3/selectors3/xhtml/css3-modsel-21c.xml: Removed.
2118
* css3/selectors3/xhtml/css3-modsel-22.xml: Removed.
2119
* css3/selectors3/xhtml/css3-modsel-23.xml: Removed.
2120
* css3/selectors3/xhtml/css3-modsel-24.xml: Removed.
2121
* css3/selectors3/xhtml/css3-modsel-25.xml: Removed.
2122
* css3/selectors3/xhtml/css3-modsel-27.xml: Removed.
2123
* css3/selectors3/xhtml/css3-modsel-27a-expected.png: Removed.
2124
* css3/selectors3/xhtml/css3-modsel-27a.xml: Removed.
2125
* css3/selectors3/xhtml/css3-modsel-27b-expected.png: Removed.
2126
* css3/selectors3/xhtml/css3-modsel-27b.xml: Removed.
2127
* css3/selectors3/xhtml/css3-modsel-28.xml: Removed.
2128
* css3/selectors3/xhtml/css3-modsel-28b.xml: Removed.
2129
* css3/selectors3/xhtml/css3-modsel-29.xml: Removed.
2130
* css3/selectors3/xhtml/css3-modsel-29b.xml: Removed.
2131
* css3/selectors3/xhtml/css3-modsel-3.xml: Removed.
2132
* css3/selectors3/xhtml/css3-modsel-30.xml: Removed.
2133
* css3/selectors3/xhtml/css3-modsel-31.xml: Removed.
2134
* css3/selectors3/xhtml/css3-modsel-32.xml: Removed.
2135
* css3/selectors3/xhtml/css3-modsel-33.xml: Removed.
2136
* css3/selectors3/xhtml/css3-modsel-34.xml: Removed.
2137
* css3/selectors3/xhtml/css3-modsel-35.xml: Removed.
2138
* css3/selectors3/xhtml/css3-modsel-36.xml: Removed.
2139
* css3/selectors3/xhtml/css3-modsel-37.xml: Removed.
2140
* css3/selectors3/xhtml/css3-modsel-38.xml: Removed.
2141
* css3/selectors3/xhtml/css3-modsel-39.xml: Removed.
2142
* css3/selectors3/xhtml/css3-modsel-39a.xml: Removed.
2143
* css3/selectors3/xhtml/css3-modsel-39b.xml: Removed.
2144
* css3/selectors3/xhtml/css3-modsel-39c.xml: Removed.
2145
* css3/selectors3/xhtml/css3-modsel-3a.xml: Removed.
2146
* css3/selectors3/xhtml/css3-modsel-4.xml: Removed.
2147
* css3/selectors3/xhtml/css3-modsel-41.xml: Removed.
2148
* css3/selectors3/xhtml/css3-modsel-41a.xml: Removed.
2149
* css3/selectors3/xhtml/css3-modsel-42.xml: Removed.
2150
* css3/selectors3/xhtml/css3-modsel-42a.xml: Removed.
2151
* css3/selectors3/xhtml/css3-modsel-43.xml: Removed.
2152
* css3/selectors3/xhtml/css3-modsel-43b.xml: Removed.
2153
* css3/selectors3/xhtml/css3-modsel-44.xml: Removed.
2154
* css3/selectors3/xhtml/css3-modsel-44b.xml: Removed.
2155
* css3/selectors3/xhtml/css3-modsel-44c.xml: Removed.
2156
* css3/selectors3/xhtml/css3-modsel-44d.xml: Removed.
2157
* css3/selectors3/xhtml/css3-modsel-45.xml: Removed.
2158
* css3/selectors3/xhtml/css3-modsel-45b.xml: Removed.
2159
* css3/selectors3/xhtml/css3-modsel-45c.xml: Removed.
2160
* css3/selectors3/xhtml/css3-modsel-46.xml: Removed.
2161
* css3/selectors3/xhtml/css3-modsel-46b.xml: Removed.
2162
* css3/selectors3/xhtml/css3-modsel-47.xml: Removed.
2163
* css3/selectors3/xhtml/css3-modsel-48.xml: Removed.
2164
* css3/selectors3/xhtml/css3-modsel-49.xml: Removed.
2165
* css3/selectors3/xhtml/css3-modsel-5.xml: Removed.
2166
* css3/selectors3/xhtml/css3-modsel-50.xml: Removed.
2167
* css3/selectors3/xhtml/css3-modsel-51.xml: Removed.
2168
* css3/selectors3/xhtml/css3-modsel-52.xml: Removed.
2169
* css3/selectors3/xhtml/css3-modsel-53.xml: Removed.
2170
* css3/selectors3/xhtml/css3-modsel-54.xml: Removed.
2171
* css3/selectors3/xhtml/css3-modsel-55.xml: Removed.
2172
* css3/selectors3/xhtml/css3-modsel-56.xml: Removed.
2173
* css3/selectors3/xhtml/css3-modsel-57.xml: Removed.
2174
* css3/selectors3/xhtml/css3-modsel-57b.xml: Removed.
2175
* css3/selectors3/xhtml/css3-modsel-59.xml: Removed.
2176
* css3/selectors3/xhtml/css3-modsel-6.xml: Removed.
2177
* css3/selectors3/xhtml/css3-modsel-60.xml: Removed.
2178
* css3/selectors3/xhtml/css3-modsel-61-expected.png: Removed.
2179
* css3/selectors3/xhtml/css3-modsel-61.xml: Removed.
2180
* css3/selectors3/xhtml/css3-modsel-62.xml: Removed.
2181
* css3/selectors3/xhtml/css3-modsel-63.xml: Removed.
2182
* css3/selectors3/xhtml/css3-modsel-64.xml: Removed.
2183
* css3/selectors3/xhtml/css3-modsel-65.xml: Removed.
2184
* css3/selectors3/xhtml/css3-modsel-66.xml: Removed.
2185
* css3/selectors3/xhtml/css3-modsel-66b.xml: Removed.
2186
* css3/selectors3/xhtml/css3-modsel-67.xml: Removed.
2187
* css3/selectors3/xhtml/css3-modsel-68.xml: Removed.
2188
* css3/selectors3/xhtml/css3-modsel-69.xml: Removed.
2189
* css3/selectors3/xhtml/css3-modsel-7.xml: Removed.
2190
* css3/selectors3/xhtml/css3-modsel-70.xml: Removed.
2191
* css3/selectors3/xhtml/css3-modsel-72.xml: Removed.
2192
* css3/selectors3/xhtml/css3-modsel-72b.xml: Removed.
2193
* css3/selectors3/xhtml/css3-modsel-73.xml: Removed.
2194
* css3/selectors3/xhtml/css3-modsel-73b.xml: Removed.
2195
* css3/selectors3/xhtml/css3-modsel-74.xml: Removed.
2196
* css3/selectors3/xhtml/css3-modsel-74b.xml: Removed.
2197
* css3/selectors3/xhtml/css3-modsel-75.xml: Removed.
2198
* css3/selectors3/xhtml/css3-modsel-75b.xml: Removed.
2199
* css3/selectors3/xhtml/css3-modsel-76.xml: Removed.
2200
* css3/selectors3/xhtml/css3-modsel-76b.xml: Removed.
2201
* css3/selectors3/xhtml/css3-modsel-77.xml: Removed.
2202
* css3/selectors3/xhtml/css3-modsel-77b.xml: Removed.
2203
* css3/selectors3/xhtml/css3-modsel-78.xml: Removed.
2204
* css3/selectors3/xhtml/css3-modsel-78b.xml: Removed.
2205
* css3/selectors3/xhtml/css3-modsel-79.xml: Removed.
2206
* css3/selectors3/xhtml/css3-modsel-7b.xml: Removed.
2207
* css3/selectors3/xhtml/css3-modsel-8.xml: Removed.
2208
* css3/selectors3/xhtml/css3-modsel-80.xml: Removed.
2209
* css3/selectors3/xhtml/css3-modsel-81.xml: Removed.
2210
* css3/selectors3/xhtml/css3-modsel-81b.xml: Removed.
2211
* css3/selectors3/xhtml/css3-modsel-82.xml: Removed.
2212
* css3/selectors3/xhtml/css3-modsel-82b.xml: Removed.
2213
* css3/selectors3/xhtml/css3-modsel-83.xml: Removed.
2214
* css3/selectors3/xhtml/css3-modsel-86.xml: Removed.
2215
* css3/selectors3/xhtml/css3-modsel-87.xml: Removed.
2216
* css3/selectors3/xhtml/css3-modsel-87b.xml: Removed.
2217
* css3/selectors3/xhtml/css3-modsel-88.xml: Removed.
2218
* css3/selectors3/xhtml/css3-modsel-88b.xml: Removed.
2219
* css3/selectors3/xhtml/css3-modsel-89.xml: Removed.
2220
* css3/selectors3/xhtml/css3-modsel-9.xml: Removed.
2221
* css3/selectors3/xhtml/css3-modsel-90.xml: Removed.
2222
* css3/selectors3/xhtml/css3-modsel-90b.xml: Removed.
2223
* css3/selectors3/xhtml/css3-modsel-91-expected.png: Removed.
2224
* css3/selectors3/xhtml/css3-modsel-91.xml: Removed.
2225
* css3/selectors3/xhtml/css3-modsel-92-expected.png: Removed.
2226
* css3/selectors3/xhtml/css3-modsel-92.xml: Removed.
2227
* css3/selectors3/xhtml/css3-modsel-93.xml: Removed.
2228
* css3/selectors3/xhtml/css3-modsel-94.xml: Removed.
2229
* css3/selectors3/xhtml/css3-modsel-94b.xml: Removed.
2230
* css3/selectors3/xhtml/css3-modsel-95.xml: Removed.
2231
* css3/selectors3/xhtml/css3-modsel-96.xml: Removed.
2232
* css3/selectors3/xhtml/css3-modsel-96b.xml: Removed.
2233
* css3/selectors3/xhtml/css3-modsel-97.xml: Removed.
2234
* css3/selectors3/xhtml/css3-modsel-97b.xml: Removed.
2235
* css3/selectors3/xhtml/css3-modsel-98.xml: Removed.
2236
* css3/selectors3/xhtml/css3-modsel-98b.xml: Removed.
2237
* css3/selectors3/xhtml/css3-modsel-99.xml: Removed.
2238
* css3/selectors3/xhtml/css3-modsel-99b.xml: Removed.
2239
* css3/selectors3/xhtml/css3-modsel-d1.xml: Removed.
2240
* css3/selectors3/xhtml/css3-modsel-d1b.xml: Removed.
2241
* css3/selectors3/xhtml/css3-modsel-d2.xml: Removed.
2242
* css3/selectors3/xhtml/css3-modsel-d3.xml: Removed.
2243
* css3/selectors3/xhtml/css3-modsel-d4.xml: Removed.
2244
* css3/selectors3/xml/css3-modsel-1.css: Removed.
2245
* css3/selectors3/xml/css3-modsel-1.xml: Removed.
2246
* css3/selectors3/xml/css3-modsel-10.css: Removed.
2247
* css3/selectors3/xml/css3-modsel-10.xml: Removed.
2248
* css3/selectors3/xml/css3-modsel-100.css: Removed.
2249
* css3/selectors3/xml/css3-modsel-100.xml: Removed.
2250
* css3/selectors3/xml/css3-modsel-100b.css: Removed.
2251
* css3/selectors3/xml/css3-modsel-100b.xml: Removed.
2252
* css3/selectors3/xml/css3-modsel-101.css: Removed.
2253
* css3/selectors3/xml/css3-modsel-101.xml: Removed.
2254
* css3/selectors3/xml/css3-modsel-101b.css: Removed.
2255
* css3/selectors3/xml/css3-modsel-101b.xml: Removed.
2256
* css3/selectors3/xml/css3-modsel-102.css: Removed.
2257
* css3/selectors3/xml/css3-modsel-102.xml: Removed.
2258
* css3/selectors3/xml/css3-modsel-102b.css: Removed.
2259
* css3/selectors3/xml/css3-modsel-102b.xml: Removed.
2260
* css3/selectors3/xml/css3-modsel-103.css: Removed.
2261
* css3/selectors3/xml/css3-modsel-103.xml: Removed.
2262
* css3/selectors3/xml/css3-modsel-103b.css: Removed.
2263
* css3/selectors3/xml/css3-modsel-103b.xml: Removed.
2264
* css3/selectors3/xml/css3-modsel-104.css: Removed.
2265
* css3/selectors3/xml/css3-modsel-104.xml: Removed.
2266
* css3/selectors3/xml/css3-modsel-104b.css: Removed.
2267
* css3/selectors3/xml/css3-modsel-104b.xml: Removed.
2268
* css3/selectors3/xml/css3-modsel-105.css: Removed.
2269
* css3/selectors3/xml/css3-modsel-105.xml: Removed.
2270
* css3/selectors3/xml/css3-modsel-105b.css: Removed.
2271
* css3/selectors3/xml/css3-modsel-105b.xml: Removed.
2272
* css3/selectors3/xml/css3-modsel-106.css: Removed.
2273
* css3/selectors3/xml/css3-modsel-106.xml: Removed.
2274
* css3/selectors3/xml/css3-modsel-106b.css: Removed.
2275
* css3/selectors3/xml/css3-modsel-106b.xml: Removed.
2276
* css3/selectors3/xml/css3-modsel-107.css: Removed.
2277
* css3/selectors3/xml/css3-modsel-107.xml: Removed.
2278
* css3/selectors3/xml/css3-modsel-107b.css: Removed.
2279
* css3/selectors3/xml/css3-modsel-107b.xml: Removed.
2280
* css3/selectors3/xml/css3-modsel-108.css: Removed.
2281
* css3/selectors3/xml/css3-modsel-108.xml: Removed.
2282
* css3/selectors3/xml/css3-modsel-108b.css: Removed.
2283
* css3/selectors3/xml/css3-modsel-108b.xml: Removed.
2284
* css3/selectors3/xml/css3-modsel-109.css: Removed.
2285
* css3/selectors3/xml/css3-modsel-109.xml: Removed.
2286
* css3/selectors3/xml/css3-modsel-109b.css: Removed.
2287
* css3/selectors3/xml/css3-modsel-109b.xml: Removed.
2288
* css3/selectors3/xml/css3-modsel-11.css: Removed.
2289
* css3/selectors3/xml/css3-modsel-11.xml: Removed.
2290
* css3/selectors3/xml/css3-modsel-110.css: Removed.
2291
* css3/selectors3/xml/css3-modsel-110.xml: Removed.
2292
* css3/selectors3/xml/css3-modsel-110b.css: Removed.
2293
* css3/selectors3/xml/css3-modsel-110b.xml: Removed.
2294
* css3/selectors3/xml/css3-modsel-111.css: Removed.
2295
* css3/selectors3/xml/css3-modsel-111.xml: Removed.
2296
* css3/selectors3/xml/css3-modsel-111b.css: Removed.
2297
* css3/selectors3/xml/css3-modsel-111b.xml: Removed.
2298
* css3/selectors3/xml/css3-modsel-112.css: Removed.
2299
* css3/selectors3/xml/css3-modsel-112.xml: Removed.
2300
* css3/selectors3/xml/css3-modsel-112b.css: Removed.
2301
* css3/selectors3/xml/css3-modsel-112b.xml: Removed.
2302
* css3/selectors3/xml/css3-modsel-113.css: Removed.
2303
* css3/selectors3/xml/css3-modsel-113.xml: Removed.
2304
* css3/selectors3/xml/css3-modsel-113b.css: Removed.
2305
* css3/selectors3/xml/css3-modsel-113b.xml: Removed.
2306
* css3/selectors3/xml/css3-modsel-114.css: Removed.
2307
* css3/selectors3/xml/css3-modsel-114.xml: Removed.
2308
* css3/selectors3/xml/css3-modsel-114b.css: Removed.
2309
* css3/selectors3/xml/css3-modsel-114b.xml: Removed.
2310
* css3/selectors3/xml/css3-modsel-115.css: Removed.
2311
* css3/selectors3/xml/css3-modsel-115.xml: Removed.
2312
* css3/selectors3/xml/css3-modsel-115b.css: Removed.
2313
* css3/selectors3/xml/css3-modsel-115b.xml: Removed.
2314
* css3/selectors3/xml/css3-modsel-116.css: Removed.
2315
* css3/selectors3/xml/css3-modsel-116.xml: Removed.
2316
* css3/selectors3/xml/css3-modsel-116b.css: Removed.
2317
* css3/selectors3/xml/css3-modsel-116b.xml: Removed.
2318
* css3/selectors3/xml/css3-modsel-117.css: Removed.
2319
* css3/selectors3/xml/css3-modsel-117.xml: Removed.
2320
* css3/selectors3/xml/css3-modsel-117b.css: Removed.
2321
* css3/selectors3/xml/css3-modsel-117b.xml: Removed.
2322
* css3/selectors3/xml/css3-modsel-118.css: Removed.
2323
* css3/selectors3/xml/css3-modsel-118.xml: Removed.
2324
* css3/selectors3/xml/css3-modsel-119.css: Removed.
2325
* css3/selectors3/xml/css3-modsel-119.xml: Removed.
2326
* css3/selectors3/xml/css3-modsel-120.css: Removed.
2327
* css3/selectors3/xml/css3-modsel-120.xml: Removed.
2328
* css3/selectors3/xml/css3-modsel-121.css: Removed.
2329
* css3/selectors3/xml/css3-modsel-121.xml: Removed.
2330
* css3/selectors3/xml/css3-modsel-122.css: Removed.
2331
* css3/selectors3/xml/css3-modsel-122.xml: Removed.
2332
* css3/selectors3/xml/css3-modsel-123.css: Removed.
2333
* css3/selectors3/xml/css3-modsel-123.xml: Removed.
2334
* css3/selectors3/xml/css3-modsel-123b-expected.png: Removed.
2335
* css3/selectors3/xml/css3-modsel-123b.css: Removed.
2336
* css3/selectors3/xml/css3-modsel-123b.xml: Removed.
2337
* css3/selectors3/xml/css3-modsel-124.css: Removed.
2338
* css3/selectors3/xml/css3-modsel-124.xml: Removed.
2339
* css3/selectors3/xml/css3-modsel-124b.css: Removed.
2340
* css3/selectors3/xml/css3-modsel-124b.xml: Removed.
2341
* css3/selectors3/xml/css3-modsel-125.css: Removed.
2342
* css3/selectors3/xml/css3-modsel-125.xml: Removed.
2343
* css3/selectors3/xml/css3-modsel-125b.css: Removed.
2344
* css3/selectors3/xml/css3-modsel-125b.xml: Removed.
2345
* css3/selectors3/xml/css3-modsel-126.css: Removed.
2346
* css3/selectors3/xml/css3-modsel-126.xml: Removed.
2347
* css3/selectors3/xml/css3-modsel-126b.css: Removed.
2348
* css3/selectors3/xml/css3-modsel-126b.xml: Removed.
2349
* css3/selectors3/xml/css3-modsel-127.css: Removed.
2350
* css3/selectors3/xml/css3-modsel-127.xml: Removed.
2351
* css3/selectors3/xml/css3-modsel-127b.css: Removed.
2352
* css3/selectors3/xml/css3-modsel-127b.xml: Removed.
2353
* css3/selectors3/xml/css3-modsel-128.css: Removed.
2354
* css3/selectors3/xml/css3-modsel-128.xml: Removed.
2355
* css3/selectors3/xml/css3-modsel-128b.css: Removed.
2356
* css3/selectors3/xml/css3-modsel-128b.xml: Removed.
2357
* css3/selectors3/xml/css3-modsel-129.css: Removed.
2358
* css3/selectors3/xml/css3-modsel-129.xml: Removed.
2359
* css3/selectors3/xml/css3-modsel-129b.css: Removed.
2360
* css3/selectors3/xml/css3-modsel-129b.xml: Removed.
2361
* css3/selectors3/xml/css3-modsel-13.css: Removed.
2362
* css3/selectors3/xml/css3-modsel-13.xml: Removed.
2363
* css3/selectors3/xml/css3-modsel-130.css: Removed.
2364
* css3/selectors3/xml/css3-modsel-130.xml: Removed.
2365
* css3/selectors3/xml/css3-modsel-130b.css: Removed.
2366
* css3/selectors3/xml/css3-modsel-130b.xml: Removed.
2367
* css3/selectors3/xml/css3-modsel-131.css: Removed.
2368
* css3/selectors3/xml/css3-modsel-131.xml: Removed.
2369
* css3/selectors3/xml/css3-modsel-131b.css: Removed.
2370
* css3/selectors3/xml/css3-modsel-131b.xml: Removed.
2371
* css3/selectors3/xml/css3-modsel-132.css: Removed.
2372
* css3/selectors3/xml/css3-modsel-132.xml: Removed.
2373
* css3/selectors3/xml/css3-modsel-132b.css: Removed.
2374
* css3/selectors3/xml/css3-modsel-132b.xml: Removed.
2375
* css3/selectors3/xml/css3-modsel-133.css: Removed.
2376
* css3/selectors3/xml/css3-modsel-133.xml: Removed.
2377
* css3/selectors3/xml/css3-modsel-133b.css: Removed.
2378
* css3/selectors3/xml/css3-modsel-133b.xml: Removed.
2379
* css3/selectors3/xml/css3-modsel-134.css: Removed.
2380
* css3/selectors3/xml/css3-modsel-134.xml: Removed.
2381
* css3/selectors3/xml/css3-modsel-134b.css: Removed.
2382
* css3/selectors3/xml/css3-modsel-134b.xml: Removed.
2383
* css3/selectors3/xml/css3-modsel-135.css: Removed.
2384
* css3/selectors3/xml/css3-modsel-135.xml: Removed.
2385
* css3/selectors3/xml/css3-modsel-135b.css: Removed.
2386
* css3/selectors3/xml/css3-modsel-135b.xml: Removed.
2387
* css3/selectors3/xml/css3-modsel-136.css: Removed.
2388
* css3/selectors3/xml/css3-modsel-136.xml: Removed.
2389
* css3/selectors3/xml/css3-modsel-136b.css: Removed.
2390
* css3/selectors3/xml/css3-modsel-136b.xml: Removed.
2391
* css3/selectors3/xml/css3-modsel-137.css: Removed.
2392
* css3/selectors3/xml/css3-modsel-137.xml: Removed.
2393
* css3/selectors3/xml/css3-modsel-137b.css: Removed.
2394
* css3/selectors3/xml/css3-modsel-137b.xml: Removed.
2395
* css3/selectors3/xml/css3-modsel-138.css: Removed.
2396
* css3/selectors3/xml/css3-modsel-138.xml: Removed.
2397
* css3/selectors3/xml/css3-modsel-138b.css: Removed.
2398
* css3/selectors3/xml/css3-modsel-138b.xml: Removed.
2399
* css3/selectors3/xml/css3-modsel-139.css: Removed.
2400
* css3/selectors3/xml/css3-modsel-139.xml: Removed.
2401
* css3/selectors3/xml/css3-modsel-139b.css: Removed.
2402
* css3/selectors3/xml/css3-modsel-139b.xml: Removed.
2403
* css3/selectors3/xml/css3-modsel-14.css: Removed.
2404
* css3/selectors3/xml/css3-modsel-14.xml: Removed.
2405
* css3/selectors3/xml/css3-modsel-140.css: Removed.
2406
* css3/selectors3/xml/css3-modsel-140.xml: Removed.
2407
* css3/selectors3/xml/css3-modsel-140b.css: Removed.
2408
* css3/selectors3/xml/css3-modsel-140b.xml: Removed.
2409
* css3/selectors3/xml/css3-modsel-141.css: Removed.
2410
* css3/selectors3/xml/css3-modsel-141.xml: Removed.
2411
* css3/selectors3/xml/css3-modsel-141b.css: Removed.
2412
* css3/selectors3/xml/css3-modsel-141b.xml: Removed.
2413
* css3/selectors3/xml/css3-modsel-142.css: Removed.
2414
* css3/selectors3/xml/css3-modsel-142.xml: Removed.
2415
* css3/selectors3/xml/css3-modsel-142b.css: Removed.
2416
* css3/selectors3/xml/css3-modsel-142b.xml: Removed.
2417
* css3/selectors3/xml/css3-modsel-143.css: Removed.
2418
* css3/selectors3/xml/css3-modsel-143.xml: Removed.
2419
* css3/selectors3/xml/css3-modsel-143b.css: Removed.
2420
* css3/selectors3/xml/css3-modsel-143b.xml: Removed.
2421
* css3/selectors3/xml/css3-modsel-144.css: Removed.
2422
* css3/selectors3/xml/css3-modsel-144.xml: Removed.
2423
* css3/selectors3/xml/css3-modsel-145a.css: Removed.
2424
* css3/selectors3/xml/css3-modsel-145a.xml: Removed.
2425
* css3/selectors3/xml/css3-modsel-145b.css: Removed.
2426
* css3/selectors3/xml/css3-modsel-145b.xml: Removed.
2427
* css3/selectors3/xml/css3-modsel-146a.css: Removed.
2428
* css3/selectors3/xml/css3-modsel-146a.xml: Removed.
2429
* css3/selectors3/xml/css3-modsel-146b.css: Removed.
2430
* css3/selectors3/xml/css3-modsel-146b.xml: Removed.
2431
* css3/selectors3/xml/css3-modsel-147a.css: Removed.
2432
* css3/selectors3/xml/css3-modsel-147a.xml: Removed.
2433
* css3/selectors3/xml/css3-modsel-147b.css: Removed.
2434
* css3/selectors3/xml/css3-modsel-147b.xml: Removed.
2435
* css3/selectors3/xml/css3-modsel-148.css: Removed.
2436
* css3/selectors3/xml/css3-modsel-148.xml: Removed.
2437
* css3/selectors3/xml/css3-modsel-149.css: Removed.
2438
* css3/selectors3/xml/css3-modsel-149.xml: Removed.
2439
* css3/selectors3/xml/css3-modsel-149b.css: Removed.
2440
* css3/selectors3/xml/css3-modsel-149b.xml: Removed.
2441
* css3/selectors3/xml/css3-modsel-14b.css: Removed.
2442
* css3/selectors3/xml/css3-modsel-14b.xml: Removed.
2443
* css3/selectors3/xml/css3-modsel-14c.css: Removed.
2444
* css3/selectors3/xml/css3-modsel-14c.xml: Removed.
2445
* css3/selectors3/xml/css3-modsel-14d.css: Removed.
2446
* css3/selectors3/xml/css3-modsel-14d.xml: Removed.
2447
* css3/selectors3/xml/css3-modsel-14e.css: Removed.
2448
* css3/selectors3/xml/css3-modsel-14e.xml: Removed.
2449
* css3/selectors3/xml/css3-modsel-15.css: Removed.
2450
* css3/selectors3/xml/css3-modsel-15.xml: Removed.
2451
* css3/selectors3/xml/css3-modsel-150.css: Removed.
2452
* css3/selectors3/xml/css3-modsel-150.xml: Removed.
2453
* css3/selectors3/xml/css3-modsel-151.css: Removed.
2454
* css3/selectors3/xml/css3-modsel-151.xml: Removed.
2455
* css3/selectors3/xml/css3-modsel-152.css: Removed.
2456
* css3/selectors3/xml/css3-modsel-152.xml: Removed.
2457
* css3/selectors3/xml/css3-modsel-153.css: Removed.
2458
* css3/selectors3/xml/css3-modsel-153.xml: Removed.
2459
* css3/selectors3/xml/css3-modsel-154.css: Removed.
2460
* css3/selectors3/xml/css3-modsel-154.xml: Removed.
2461
* css3/selectors3/xml/css3-modsel-155.css: Removed.
2462
* css3/selectors3/xml/css3-modsel-155.xml: Removed.